Tema: Kultur och fritid (hbtqi)
type: Collection
issued: 2022-12-19T13:03:41
modified: 2023-12-06T09:24:17
in scheme: Queerlit
member: Hbtqi-barer
member: Hbtqi-slang
member: Hbtqi-evenemang
member: Badplatser (hbtqi)
member: TV (hbtqi)
member: Musikaler
member: Körer (hbtqi)
member: Litterära salonger (hbtqi)
member: Camp
member: Förläggare (hbtqi)
member: Radio (hbtqi)
member: Konst (hbtqi)
member: Subkulturer
member: Hotell (hbtqi)
member: Restauranger (hbtqi)
member: Uteliv (hbtqi)
member: Bokcirklar (hbtqi)
member: Turism (hbtqi)
member: Bokhandlar (hbtqi)

Tema: Relationer (hbtqi)
type: Collection
issued: 2022-12-19T13:03:41
modified: 2023-12-06T09:24:17
in scheme: Queerlit
member: Samlevnadsformer
member: Diskretion (hbtqi)
member: Spekulationer (hbtqi)
member: Relationspreferens
member: Celibat
member: Komma ut
member: Relationer (hbtqi)
member: Skaffa barn (hbtqi)
member: Hbtqi-familjer
member: Familjemedlemmar
member: Bröllop (hbtqi)
member: Barnlängtan
member: Homosocialitet
member: Svartsjuka (hbtqi)
member: Döden och döende (hbtqi)

Tema: Övrigt (hbtqi)
type: Collection
issued: 2022-12-19T13:03:41
modified: 2023-12-06T09:24:17
in scheme: Queerlit
member: Kläder
member: Symbolik (hbtqi)
member: Informationsförmedling
member: Sexarbetare (hbtqi)
member: Sociala medier
member: Sociala normer
member: Djur (hbtqi)
member: Äldreboenden (hbtqi)
member: Offentliga hygieninrättningar
member: Skolan (hbtqi)
member: Sexarbete
member: Poliser
member: Juridik
member: Sexköpare
member: Sexindustri
member: Droganvändning (hbtqi)

Tema: Identiteter och praktiker (hbtqi)
type: Collection
issued: 2022-12-19T13:03:41
modified: 2023-12-06T09:24:17
in scheme: Queerlit
member: Personer som lever med hiv
member: Hbtqi+
member: Äldre
member: Heterosexuella
member: Barn
member: Könsöverskridanden
member: Sexuell identitet
member: Latent homosexualitet
member: Hbtqi-personer
member: Okönade personer
member: Rollbeteende
member: Situationsbetingat sexuellt beteende
member: Historiska termer (hbtqi)
member: Kön
member: Ungdomar
member: Asexuella
member: Sexuell läggning

Tema: Medicin (hbtqi)
type: Collection
issued: 2022-12-19T13:03:41
modified: 2023-12-06T09:24:17
in scheme: Queerlit
member: Psykisk ohälsa
member: Preventivmedel
member: Substansmissbruk (hbtqi)
member: Könssjukdomar
member: Donatorer (medicin)
member: Hälso- och sjukvård
member: Omskärelse
member: Sexuell dysfunktion
member: Kastrering
member: Sexmissbruk
member: Medvetenhet om hiv/aids

Tema: Diskriminering, hat och våld (hbtqi)
type: Collection
issued: 2022-12-19T13:03:41
modified: 2023-12-06T09:24:17
in scheme: Queerlit
member: Könsstympning av intersexpersoner
member: Intolerans mot hbtqi-personer
member: Våld mot hbtqi-personer
member: Skällsord
member: Misogyni
member: Hbtqi-fobi
member: Förnekande av sexuell läggning
member: Förföljelse av hbtqi-personer
member: Trakasserier
member: Självförtryck (hbtqi)
member: Tvångssterilisering
member: Sexuellt våld
member: Censur
member: Utpressning (hbtqi)
member: Hiv-/aidsfobi
member: Sexism
member: Heterosexism
member: Mobbning
member: Diskriminering av hbtqi-personer
member: Rasism (hbtqi)
member: Könsstympning
member: Hatbrott

Tema: Livsåskådning, tro och teorier (hbtqi)
type: Collection
issued: 2022-12-19T13:03:41
modified: 2023-12-06T09:24:17
in scheme: Queerlit
member: Ateism (hbtqi)
member: Religion (hbtqi)
member: Gudinnerörelser (hbtqi)
member: Religiösa ledare (hbtqi)
member: Genusvetenskap
member: Queerstudier
member: Teorier (hbtqi)
member: Häxor (hbtqi)
member: Andlighet (hbtqi)

Tema: Rörelser och rättigheter (hbtqi)
type: Collection
issued: 2022-12-19T13:03:41
modified: 2023-12-06T09:24:17
in scheme: Queerlit
member: Sociala processer (hbtqi)
member: Hbtqi-aktivism
member: Hbtqi-mötesplatser
member: Sexuell revolution
member: Hbtqi-föreningar
member: Feminism
member: Kravaller (hbtqi)
member: Rättsstatus
member: Hbtqi-gemenskaper
member: Feminister
member: Mänskliga rättigheter
member: Hbtqi-minnesmärken
member: Sociala rörelser
member: Normalisering
member: Hbtqi-separatism

Tema: Sex, intimitet och kroppslighet (hbtqi)
type: Collection
issued: 2022-12-19T13:03:41
modified: 2023-12-06T09:24:17
in scheme: Queerlit
member: Porrfilmer (hbtqi)
member: Sexuell preferens
member: Sexställen
member: Sexhjälpmedel
member: Sexualitet
member: Sexuella riskbeteenden
member: Förförelse
member: Massage
member: Erogena zoner
member: Erotik
member: Sexuella praktiker
member: Känslor (hbtqi)
member: Nakenbilder
member: Sex
member: Sexuellt samtycke
member: Kroppslig närhet
member: Sexuell upphetsning
member: Nudism

Polygami
type: Concept
issued: 2022-05-19T10:12:00
modified: 2023-05-10T08:32:00
alternative label: Månggifte
broader: Flersamma relationer
in scheme: Queerlit
scope note: Används för skildringar av äktenskapsform där personer är gifta med flera andra.

Handklovar
type: Concept
issued: 2022-05-19T10:12:00
modified: 2022-05-19T10:12:00
alternative label: Handbojor
broader: Sexhjälpmedel
in scheme: Queerlit
scope note: Används för skildringar av handbojor i en sexuell kontext.

Främmande seder (hbtqi)
type: Concept
issued: 2022-05-19T10:12:00
modified: 2023-12-06T09:24:17
alternative label: Franska seder (hbtqi)
alternative label: Italienska seder (hbtqi)
broader: Historiska termer (hbtqi)
in scheme: Queerlit
scope note: Används för skildringar, historiska eller historiserande, där hänvisningar till främmande seder används för att signalera samkönade sexuella praktiker, känslor, identiteter och/eller överskridanden av binära könsnormer.

Mormonism (hbtqi)
type: Concept
issued: 2022-05-19T10:12:00
modified: 2023-12-06T09:24:17
alternative label: Hbtqi-mormoner
alternative label: Mormoner (hbtqi)
broader: Kristendom (hbtqi)
in scheme: Queerlit
scope note: Används för skildringar av hbtqi-personer som är mormoner. Används även för skildringar av hbtqi-personers förhållningssätt till mormonism eller andra mormoners förhållningssätt till hbtqi.

Alkoholism (hbtqi)
type: Concept
issued: 2022-05-19T10:12:00
modified: 2023-12-06T09:24:17
alternative label: Alkoholberoende hos hbtqi-personer
alternative label: Alkoholmissbruk hos hbtqi-personer
alternative label: Alkoholmissbrukande hbtqi-personer
alternative label: Hbtqi-personer med alkoholberoende
alternative label: Hbtqi-personer med alkoholmissbruk
alternative label: Hbtqi-personer som lever i alkoholberoende
alternative label: Hbtqi-personer som lever i alkoholmissbruk
alternative label: Hbtqi-personer som missbrukar alkohol
alternative label: Hbtqi-personer som är beroende av alkohol
broader: Substansmissbruk (hbtqi)
in scheme: Queerlit
scope note: Används för skildringar där hbtqi-personer missbrukar eller är beroende av alkohol. Med missbruk menas här sådant bruk som skadar hälsa och relationer.

Sjöfolk (hbtqi)
type: Concept
issued: 2022-05-19T10:12:00
modified: 2023-12-06T09:24:17
alternative label: Flottister (hbtqi)
alternative label: Kaptener (hbtqi)
alternative label: Matroser (hbtqi)
alternative label: Pirater (hbtqi)
alternative label: Sjömän (hbtqi)
broader: Hbtqi-personer
in scheme: Queerlit
scope note: Används för skildringar av hbtqi-personer som yrkesmässigt arbetar ombord på fartyg till sjöss, eller skildringar av sjöfolk där hbtqi-tematik på annat sätt är framträdande.

Buddism (hbtqi)
type: Concept
issued: 2022-05-19T10:12:00
modified: 2023-12-06T09:24:17
alternative label: Buddhism (hbtqi)
alternative label: Buddhister (hbtqi)
alternative label: Buddister (hbtqi)
broader: Asiatiska religioner (hbtqi)
in scheme: Queerlit
scope note: Används för skildringar av hbtqi-personer som är buddister. Används även för skildringar av hbtqi-personers förhållningssätt till buddism eller andra buddisters förhållningssätt till hbtqi.

Islam (hbtqi)
type: Concept
issued: 2022-05-19T10:12:00
modified: 2023-12-06T09:24:17
alternative label: Muslimer (hbtqi)
broader: Religion (hbtqi)
in scheme: Queerlit
scope note: Används för skildringar av hbtqi-personer som är muslimer. Används även för skildringar av hbtqi-personers förhållningssätt till islam eller andra muslimers förhållningssätt till hbtqi.

Icke-våld (hbtqi)
type: Concept
issued: 2022-05-19T10:12:00
modified: 2023-12-06T09:24:17
alternative label: Ickevåld (hbtqi)
broader: Hbtqi-aktivism
in scheme: Queerlit
scope note: Används för skildringar av den politiska metoden ickevåld, politisk aktivism och motstånd utan att bruka våld, där kopplingen till hbtqi har en framträdande betydelse.

Kvinnohatare (hbtqi)
type: Concept
issued: 2022-05-19T10:12:00
modified: 2023-12-06T09:24:17
alternative label: Misogynister (hbtqi)
broader: Historiska termer (hbtqi)
in scheme: Queerlit
scope note: Används för skildringar, historiska eller historiserande, som använder begreppet kvinnohatare - ett äldre ord som under det sena 1800-talet och tidiga 1900-talet ibland användes om män som antogs vara homosexuella. Ämnesordet används inte för allmän misogyni.

Bisexuell separatism
type: Concept
issued: 2022-05-19T10:12:00
modified: 2022-05-19T10:12:00
broader: Hbtqi-separatism
in scheme: Queerlit
scope note: Används för skildringar av frivillig ideologisk, social, kulturell och ibland fysisk separation av bisexuella från heterosexuella och/eller homosexuella.

Blinda hbtqi-personer
type: Concept
issued: 2022-05-19T10:12:00
modified: 2023-12-06T09:24:17
alternative label: Blinda (hbtqi)
broader: Hbtqi-personer med synnedsättning
in scheme: Queerlit
scope note: Används för skildringar av hbtqi-personer som är blinda eller saknar ledsyn (förmåga att orientera sig i främmande miljöer med hjälp av synen).

Floggers
type: Concept
issued: 2022-05-19T10:12:00
modified: 2024-06-05T11:38:19
alternative label: Flersvansade piskor
alternative label: Gissel
broader: Sexhjälpmedel
in scheme: Queerlit
scope note: Används för skildringar av tunnare piskor använda i sexlekar.

Shintoism (hbtqi)
type: Concept
issued: 2022-05-19T10:12:00
modified: 2023-12-06T09:24:17
alternative label: Shinto (hbtqi)
alternative label: Shintoister (hbtqi)
broader: Asiatiska religioner (hbtqi)
in scheme: Queerlit
scope note: Används för skildringar av hbtqi-personer som är anhängare till den japanska religionen Shinto/shintoism. Används även för skildringar av hbtqi-personers förhållningssätt till shintoism eller andra shintoisters förhållningssätt till hbtqi.

Samer (hbtqi)
type: Concept
issued: 2022-05-19T10:12:00
modified: 2023-12-06T09:24:17
alternative label: Hbtqi-samer
alternative label: Lappar (hbtqi)
alternative label: Sámit (hbtqi)
alternative label: Sápmelaččat (hbtqi)
broader: Ursprungsbefolkningar (hbtqi)
in scheme: Queerlit
scope note: Används för skildringar av hbtqi-personer som är samer.

Korsetter
type: Concept
issued: 2022-05-19T10:12:00
modified: 2022-05-19T10:12:00
broader: Sexhjälpmedel
in scheme: Queerlit
scope note: Används för skildringar där korsetter har betydelse för verket.

Queerseparatism
type: Concept
issued: 2022-05-19T10:12:00
modified: 2022-05-19T10:12:00
broader: Hbtqi-separatism
hidden label: Queer-separatism
in scheme: Queerlit
scope note: Används för skildringar av frivillig ideologisk, social, kulturell och ibland fysisk separation av queera personer från andra.

Vita hbtqi-personer
type: Concept
issued: 2022-05-19T10:12:00
modified: 2023-12-06T09:24:17
broader: Etniska grupper (hbtqi)
in scheme: Queerlit
scope note: Används för skildringar av homosexuella, bisexuella, transpersoner, queera och/eller intersexpersoner som beskrivs som vita. Vit förstås här som en rasifierande kategori som markerar personer med melaninfattig hud, historiskt sett oftast med ursprung i Europa men begreppet har ändrats över tid och ska ses som flytande. Ämnesordet används för skildringar där identiteten som vit är i fokus.

IVF
type: Concept
issued: 2022-05-19T10:12:00
modified: 2022-05-19T10:12:00
alternative label: In vitro-fertilisering
alternative label: Provrörsbefruktning
broader: Skaffa barn (hbtqi)
in scheme: Queerlit
scope note: Används för skildringar av assisterad befruktning utanför kroppen.

Blandäktenskap (sexuell läggning)
type: Concept
issued: 2022-05-19T10:12:00
modified: 2023-03-29T10:53:01
alternative label: Konventionsäktenskap
broader: Äktenskap
hidden label: Bland-äktenskap (sexuell läggning)
in scheme: Queerlit
scope note: Används för skildringar av äktenskap där de ingående parterna har olika sexuella läggningar. Äktenskapen kan, men behöver inte, ha ingåtts för att tillmötesgå normativa förväntningar från omgivningen.

Somatisk vård (hbtqi)
type: Concept
issued: 2022-05-19T10:12:00
modified: 2023-12-06T09:24:17
alternative label: Somatisk vård för hbtqi-personer
broader: Hälso- och sjukvård (hbtqi)
in scheme: Queerlit
scope note: Används för skildringar av fysisk/kroppslig vård av hbtqi-personer.

Spridstänger
type: Concept
issued: 2022-05-19T10:12:00
modified: 2022-05-19T10:12:00
alternative label: Benspretare
alternative label: Spreader bars
broader: Sexhjälpmedel
in scheme: Queerlit
scope note: Används för skildringar av stänger i metall eller trä som används inom t.ex. BDSM för att binda fast och separera armar eller ben.

Krigsoffer (hbtqi)
type: Concept
issued: 2022-05-19T10:12:00
modified: 2023-12-06T09:24:17
alternative label: Krigsdrabbade hbtqi-personer
broader: Hbtqi-personer
hidden label: Krigs-offer (hbtqi)
in scheme: Queerlit
scope note: Används för skildringar av hbtqi-personer som drabbas eller har drabbats av väpnade konflikter.

Afrikanska religioner (hbtqi)
type: Concept
issued: 2022-05-19T10:12:00
modified: 2023-12-06T09:24:17
broader: Religion (hbtqi)
in scheme: Queerlit
scope note: Används för skildringar av hbtqi-personer som är anhängare av religioner med ursprung i Afrika. Används även för skildringar av hbtqi-personers förhållningssätt till afrikanska religioner eller hur andra anhängare av dessa religioner förhåller sig till hbtqi.

Sexdockor
type: Concept
issued: 2022-05-19T10:12:00
modified: 2022-05-19T10:12:00
alternative label: Uppblåsbara dockor
broader: Sexhjälpmedel
in scheme: Queerlit
scope note: Används för skildringar av dockor, ofta i plast eller latex i naturligt storlek, avsedda för sexuella ändamål och utrustade med t.ex. lösvagina, anus, munhåla och/eller löspenis.

Bögseparatism
type: Concept
issued: 2022-05-19T10:12:00
modified: 2022-05-19T10:12:00
broader: Homosexuell separatism
hidden label: Bög-separatism
in scheme: Queerlit
scope note: Används för skildringar av frivillig ideologisk, social, kulturell och ibland fysisk separation av bögar från kvinnor och heterosexuella män.

Jehovas vittnen (hbtqi)
type: Concept
issued: 2022-05-19T10:12:00
modified: 2023-12-06T09:24:17
broader: Kristendom (hbtqi)
in scheme: Queerlit
scope note: Används för skildringar av hbtqi-personer som är Jehovas vittnen. Används även för skildringar av hbtqi-personers förhållningssätt till Jehovas vittnen eller andra Jehovas vittnens förhållningssätt till hbtqi.

Cubs
type: Concept
issued: 2022-05-19T10:12:00
modified: 2022-06-07T15:09:28
broader: Björnar (identitet)
in scheme: Queerlit
scope note: Används för skildringar av unga personer som beskrivs som tillhörande björnsubkulturen.

Smiskpaddlar
type: Concept
issued: 2022-05-19T10:12:00
modified: 2022-05-19T10:12:00
alternative label: Paddlar (BDSM)
alternative label: Sexpaddlar
broader: Sexhjälpmedel
in scheme: Queerlit
scope note: Används för skildringar av paddlar som används för att ge smisk i sexuella sammanhang.

Studentföreningar (hbtqi)
type: Concept
issued: 2022-05-19T10:12:00
modified: 2023-12-06T09:24:17
broader: Hbtqi-föreningar
hidden label: Student-föreningar (hbtqi)
in scheme: Queerlit
scope note: Används för skildringar av studentföreningar med särskilt fokus på hbtqi-frågor eller specifikt för hbtqi-personer.

Döva hbtqi-personer
type: Concept
issued: 2022-05-19T10:12:00
modified: 2023-12-06T09:24:17
alternative label: Döva (hbtqi)
alternative label: Dövstumma (hbtqi)
alternative label: Dövstumma hbtqi-personer
broader: Fysiskt funktionshindrade hbtqi-personer
in scheme: Queerlit
scope note: Används för skildringar av hbtqi-personer med avsaknad av hörsel.

Graviditet (hbtqi)
type: Concept
issued: 2022-05-19T10:12:00
modified: 2023-12-06T09:24:17
alternative label: Bära barn (hbtqi)
alternative label: Bärande föräldrar (hbtqi)
alternative label: Gravida (hbtqi)
alternative label: Havandeskap (hbtqi)
broader: Skaffa barn (hbtqi)
in scheme: Queerlit
scope note: Används för skildringar av att, som hbtqi-person eller i ett sammanhang med andra hbtqi-personer, vara gravid.

Erektil dysfunktion
type: Concept
issued: 2022-05-19T10:12:00
modified: 2022-05-19T10:12:00
alternative label: ED
alternative label: Impotens
alternative label: Svårt att få stånd
broader: Sexuell dysfunktion
in scheme: Queerlit
scope note: Används för skildringar av personer som under längre perioder saknar förmågan att få eller behålla erektion.

Harness
type: Concept
issued: 2022-05-19T10:12:00
modified: 2022-05-19T10:12:00
alternative label: Selar (BDSM)
broader: Sexhjälpmedel
in scheme: Queerlit
scope note: Används för skildringar av selar använda inom BDSM som sex- eller mode-accessoar.

Blodgivare (hbtqi)
type: Concept
issued: 2022-05-19T10:12:00
modified: 2023-12-06T09:24:17
broader: Donatorer (medicin)
in scheme: Queerlit
scope note: Används för skildringar av blodgivare, donatorer av blod, där kopplingen till hbtqi har en framträdande betydelse.

Ergi
type: Concept
issued: 2022-05-19T10:12:00
modified: 2022-05-19T10:12:00
alternative label: Argr
alternative label: Ragr
broader: Historiska termer (hbtqi)
in scheme: Queerlit
scope note: Används för skildringar, historiska eller historiserande, som använder begreppet ergi - ett negativt laddat ord som i fornnordiskan kopplades till magi och omanlighet och bland annat använts som nedsättande feminisering av män, eller för att beskriva en passiv roll i manlig samkönad praktik.

Bisexuella rörelser
type: Concept
issued: 2022-05-19T10:12:00
modified: 2022-05-19T10:12:00
broader: Hbtqi-rörelser
in scheme: Queerlit
scope note: Används för skildringar av sociala rörelser inriktade på bisexuellas rättigheter och levnadsvillkor.

Änkor och änklingar
type: Concept
issued: 2022-05-19T10:12:00
modified: 2022-05-19T10:12:00
alternative label: Efterlevande partners
alternative label: Änkefolk
alternative label: Änklingar
alternative label: Änkor
broader: Civilstånd
in scheme: Queerlit
scope note: Används för skildringar av den överlevande partnern i ett äktenskap eller partnerskap där den andra partnern avlidit.

Samkönade äktenskap
type: Concept
issued: 2022-05-19T10:12:00
modified: 2022-05-19T10:12:00
alternative label: Homoäktenskap
alternative label: Likkönade äktenskap
broader: Äktenskap
in scheme: Queerlit
scope note: Används för skildringar av äktenskap mellan två personer av samma kön.

Begär (hbtqi)
type: Concept
issued: 2022-05-19T10:12:00
modified: 2023-12-06T09:24:17
alternative label: Homoerotik
alternative label: Samkönat begär
broader: Känslor (hbtqi)
in scheme: Queerlit
scope note: Används för skildringar där fysisk attraktion och begär som involverar hbtqi-personer har betydelse för verket.

Pronomen
type: Concept
issued: 2022-09-12T08:21:55
modified: 2022-09-12T08:21:55
alternative label: De
alternative label: Den
alternative label: Han
alternative label: Hen
alternative label: Hon
alternative label: Personliga pronomen
alternative label: Personliga pronomina
alternative label: Pronomina
broader: Könsuttryck
in scheme: Queerlit
scope note: Används för skildringar där personliga pronomen har en framträdande betydelse i verket, till exempel då det gäller neopronomen, att en person ändrar pronomen eller blir felkönad genom pronomen.

Regnbågssymbolik (hbtqi)
type: Concept
issued: 2022-05-19T10:12:00
modified: 2023-12-06T09:24:17
broader: Symbolik (hbtqi)
hidden label: Regnbågs-symbolik (hbtqi)
in scheme: Queerlit
scope note: Används för skildringar av regnbågar som symboliserar hbtqi-tematik i sammanhang där tematiken inte bättre beskrivs med andra ämnesord.

Inuiter (hbtqi)
type: Concept
issued: 2022-05-19T10:12:00
modified: 2023-12-06T09:24:17
alternative label: Eskimåer (hbtqi)
alternative label: Hbtqi-eskimåer
alternative label: Hbtqi-inuiter
broader: Ursprungsbefolkningar (hbtqi)
in scheme: Queerlit
scope note: Används för skildringar av hbtqi-personer som är inuiter.

Platonisk kärlek (hbtqi)
type: Concept
issued: 2022-05-19T10:12:00
modified: 2023-12-06T09:24:17
broader: Kärlek (hbtqi)
in scheme: Queerlit
scope note: Används för skildringar av djup och innerlig kärlek utan sexuella inslag där en eller flera av parterna är hbtqi-personer.

Taoism (hbtqi)
type: Concept
issued: 2022-05-19T10:12:00
modified: 2023-12-06T09:24:17
alternative label: Daoism (hbtqi)
alternative label: Daoister (hbtqi)
alternative label: Hbtqi-daoister
alternative label: Hbtqi-taoister
alternative label: Taoister (hbtqi)
broader: Asiatiska religioner (hbtqi)
in scheme: Queerlit
scope note: Används för skildringar av hbtqi-personer som är anhängare av den kinesiska religionen och filosofin taoism. Används även för skildringar av hbtqi-personers förhållningssätt till taoism eller andra taoisters förhållningssätt till hbtqi.

Manshatare (hbtqi)
type: Concept
issued: 2022-05-19T10:12:00
modified: 2023-12-06T09:24:17
alternative label: Manshaterskor (hbtqi)
alternative label: Misandrister (hbtqi)
broader: Historiska termer (hbtqi)
in scheme: Queerlit
scope note: Används för skildringar, historiska eller historiserande, som använder begreppet manshatare - ett äldre ord som främst under 1970-talet började användas för att misskreditera kvinnor (ofta feministiskt engagerade) som antogs vara lesbiska. Ämnesordet används inte för allmän misandri.

Intersexseparatism
type: Concept
issued: 2022-05-19T10:12:00
modified: 2022-05-19T10:12:00
broader: Hbtqi-separatism
hidden label: Intersex-separatism
in scheme: Queerlit
scope note: Används för skildringar av frivillig ideologisk, social, kulturell och ibland fysisk separation av intersexpersoner från andra.

Internetforum
type: Concept
issued: 2022-05-19T10:12:00
modified: 2023-03-29T10:53:01
alternative label: Forum
broader: Sociala medier
hidden label: Internet-forum
in scheme: Queerlit
scope note: Används för skildringar där webbaserade diskussionsforum på internet har betydelse för verket.

Konfucianism (hbtqi)
type: Concept
issued: 2022-05-19T10:12:00
modified: 2023-12-06T09:24:17
alternative label: Hbtqi-konfucianister
alternative label: Konfucianister (hbtqi)
broader: Asiatiska religioner (hbtqi)
in scheme: Queerlit
scope note: Används för skildringar av hbtqi-personer som är konfucianister. Används även för skildringar av hbtqi-personers förhållningssätt till konfucianism eller andra konfucianisters förhållningssätt till hbtqi.

Aromantiska (hbtqi)
type: Concept
issued: 2023-12-06T09:24:17
modified: 2023-12-06T09:24:17
alternative label: Aros
in scheme: Queerlit
scope note: Används för skildringar av hbtqi-personer som beskrivs som aromantiska, det vill säga inte är intresserade av romantiska relationer till andra.
top concept of: Queerlit

Kromosomer
type: Concept
issued: 2022-05-19T10:12:00
modified: 2022-05-19T10:12:00
broader: Biologiskt kön
in scheme: Queerlit
scope note: Används för skildringar där kromosomer - arvsanlagsbärande strukturer i cellkärnan - har betydelse för verket.

Bajssex
type: Concept
issued: 2022-05-19T10:12:00
modified: 2024-09-05T13:44:36
alternative label: Koprofili
alternative label: Scat
broader: Analsex
hidden label: Bajs-sex
in scheme: Queerlit
scope note: Används för skildringar av sexuell tillfredställelse med hjälp av avföring.

Spegelsymbolik (hbtqi)
type: Concept
issued: 2022-05-19T10:12:00
modified: 2023-12-06T09:24:17
broader: Symbolik (hbtqi)
hidden label: Spegel-symbolik (hbtqi)
in scheme: Queerlit
scope note: Används för skildringar där speglar och speglande används som symbolik för att signalera samkönade sexuella praktiker, känslor, identiteter och/eller överskridanden av binära könsnormer.

Sugardejting
type: Concept
issued: 2022-10-26T08:10:16
modified: 2022-10-26T08:10:16
alternative label: Sugar babies
alternative label: Sugar daddies
alternative label: Sugar dating
alternative label: Sugar mamas
alternative label: Sugar-dejting
alternative label: Sugar-dejtning
alternative label: Sugardating
alternative label: Sugardejtning
broader: Prostitution
in scheme: Queerlit
scope note: Används för skildringar av relationer som präglas av att en part ger monetär, materiell eller annan ersättning åt en annan i utbyte för intimitet eller sex.

Aboriginer (hbtqi)
type: Concept
issued: 2022-05-19T10:12:00
modified: 2023-12-06T09:24:17
alternative label: Hbtqi-aboriginer
broader: Ursprungsbefolkningar (hbtqi)
in scheme: Queerlit
scope note: Används för skildringar av hbtqi-personer som är aboriginer.

Bröstvårtsklämmor
type: Concept
issued: 2022-05-19T10:12:00
modified: 2023-03-29T10:53:01
alternative label: Nipple clamps
broader: Sexhjälpmedel
hidden label: Bröstvårts-klämmor
in scheme: Queerlit
scope note: Används för skildringar av klämmor som sätts fast på bröstvårtor som ett sexhjälpmedel.

Glidmedel
type: Concept
issued: 2022-05-19T10:12:00
modified: 2022-05-19T10:12:00
broader: Sexhjälpmedel
in scheme: Queerlit
scope note: Används för skildringar där glidmedel har betydelse för verket.

Syskon (hbtqi)
type: Concept
issued: 2022-05-19T10:12:00
modified: 2023-12-06T09:24:17
alternative label: Bröder (hbtqi)
alternative label: Hbtqi-bröder
alternative label: Hbtqi-systrar
alternative label: Regnbågssyskon
alternative label: Systrar (hbtqi)
broader: Syskon
in scheme: Queerlit
scope note: Används för skildringar av relationer mellan och till syskon som beskrivs som hbtqi-personer.

Queerrörelser
type: Concept
issued: 2022-05-19T10:12:00
modified: 2022-05-19T10:12:00
alternative label: Queera rörelser
broader: Hbtqi-rörelser
in scheme: Queerlit
scope note: Används för skildringar av sociala rörelser inriktade på queera personers rättigheter och levnadsvillkor.

Ekofeminism
type: Concept
issued: 2022-05-19T10:12:00
modified: 2022-05-19T10:12:00
broader: Feminism
hidden label: Eko-feminism
in scheme: Queerlit
scope note: Används för skildringar av rörelser och idétraditioner som sammankopplar miljöfrågor och feminism.

Synlighet (hbtqi)
type: Concept
issued: 2022-05-19T10:12:00
modified: 2023-12-06T09:24:17
broader: Sociala processer (hbtqi)
in scheme: Queerlit
scope note: Används för skildringar av hbtqi-personers synlighet i samhället i stort.

Radikalfeminism
type: Concept
issued: 2022-05-19T10:12:00
modified: 2022-05-19T10:12:00
broader: Feminism
hidden label: Radikal-feminism
in scheme: Queerlit
scope note: Används för skildringar av perspektiv inom feminismen som kräver en radikal omordning av samhället där manlig överhöghet elimineras i alla sociala och ekonomiska sammanhang.

Katolicism (hbtqi)
type: Concept
issued: 2022-05-19T10:12:00
modified: 2023-12-06T09:24:17
alternative label: Katoliker (hbtqi)
alternative label: Papism (hbtqi)
alternative label: Papister (hbtqi)
broader: Kristendom (hbtqi)
in scheme: Queerlit
scope note: Används för skildringar av hbtqi-personer som är anhängare av romersk-katolska kyrkan. Används även för skildringar av hbtqi-personers förhållningssätt till katolicism eller andra katolikers förhållningssätt till hbtqi.

Olikkönade äktenskap
type: Concept
issued: 2022-05-19T10:12:00
modified: 2023-10-19T11:39:43
alternative label: Heterosexuella äktenskap
broader: Äktenskap
in scheme: Queerlit
scope note: Används för skildringar där olikkönade äktenskap har betydelse för verket.

Kryssningar (hbtqi)
type: Concept
issued: 2022-05-19T10:12:00
modified: 2023-12-06T09:24:17
broader: Turism (hbtqi)
in scheme: Queerlit
scope note: Används för skildringar av kryssningar där hbtqi-personer har en framträdande betydelse.

Homofiler
type: Concept
issued: 2022-05-19T10:12:00
modified: 2022-05-19T10:12:00
broader: Historiska termer (hbtqi)
in scheme: Queerlit
scope note: Används för skildringar, historiska eller historiserande, som använder begreppet homofiler - ett äldre ord som lanserades under 1950-talet för att komma bort från fokus på sex i ord som "homosexuella", men snart kom att anammas som en del av en homofob vokabulär och som - i den under 1970-talet radikaliserade gayrörelsen - betraktades som beskrivande en utdaterad, diskret och respektabilitetssträvande politisk tendens bland homosexuella.

Koppel
type: Concept
issued: 2022-05-19T10:12:00
modified: 2022-05-19T10:12:00
broader: Sexhjälpmedel
in scheme: Queerlit
scope note: Används för skildringar där koppel som används för att kontrollera en individ, ofta i form av sexuell stimulering, har betydelse för verket.

Ogifta hbtqi-par
type: Concept
issued: 2022-05-19T10:12:00
modified: 2023-12-06T09:24:17
broader: Hbtqi-par
in scheme: Queerlit
scope note: Används för skildringar av hbtqi-par som inte är gifta.

Kvinnobokhandlar
type: Concept
issued: 2022-05-19T10:12:00
modified: 2024-06-05T11:38:19
broader: Bokhandlar (hbtqi)
hidden label: Kvinno-bokhandlar
in scheme: Queerlit
scope note: Används för skildringar av bokhandlar som tillhandahåller böcker om feminism, genus och sexualitet och ofta var/är en mötesplats för politiska samtal och aktivism.

Partners till queera personer
type: Concept
issued: 2022-05-19T10:12:00
modified: 2023-03-29T10:25:38
broader: Partners (hbtqi)
in scheme: Queerlit
scope note: Används för skildringar av personer som är partners till queera personer, oavsett partnerns egen identitet.

Kärlek mellan okönade personer
type: Concept
issued: 2022-05-19T10:12:00
modified: 2022-10-26T08:10:16
broader: Kärlek (hbtqi)
in scheme: Queerlit
scope note: Används för skildringar av kärlek mellan okönade personer, oavsett hur dessa definierar sin sexuella läggning.

Halloween (hbtqi)
type: Concept
issued: 2022-05-19T10:12:00
modified: 2023-12-06T09:24:17
broader: Hbtqi-evenemang
in scheme: Queerlit
scope note: Används för skildringar av högtiden Halloween där kopplingen till hbtqi har en framträdande betydelse, t.ex. som tillfälle för alternativa könsuttryck.

Sexualundervisning
type: Concept
issued: 2022-05-19T10:12:00
modified: 2023-03-29T10:53:01
alternative label: Sexualkunskap
alternative label: Sexualupplysning
broader: Informationsförmedling
hidden label: Sexual-undervisning
in scheme: Queerlit
scope note: Används för skildringar av undervisning om mänsklig sexualitet, sexuellt umgänge, sexuell anatomi, människans fortplantning, könssjukdomar, preventivmedel, ansvar och rättigheter i sexuella relationer, samlevnad, säkrare sex och andra närliggande ämnen.

Protestantism (hbtqi)
type: Concept
issued: 2022-05-19T10:12:00
modified: 2023-12-06T09:24:17
alternative label: Anglikaner (hbtqi)
alternative label: Anglikanism (hbtqi)
alternative label: Baptism (hbtqi)
alternative label: Baptister (hbtqi)
alternative label: Kalvinism (hbtqi)
alternative label: Kalvinister (hbtqi)
alternative label: Kväkare (hbtqi)
alternative label: Protestanter (hbtqi)
broader: Kristendom (hbtqi)
in scheme: Queerlit
scope note: Används för skildringar av hbtqi-personer som är protestanter. Används även för skildringar av hbtqi-personers förhållningssätt till protestantism eller andra protestanters förhållningssätt till hbtqi.

Barn till ickebinära
type: Concept
issued: 2023-12-13T10:57:15
modified: 2023-12-13T10:57:15
broader: Barn till transpersoner
in scheme: Queerlit
scope note: Används för skildringar av barn till personer som beskrivs som ickebinära.

Melodifestivaler (hbtqi)
type: Concept
issued: 2023-12-06T09:24:17
modified: 2023-12-06T09:24:17
alternative label: ESC (hbtqi)
alternative label: Eurovision (hbtqi)
alternative label: Eurovision Song Contest (hbtqi)
alternative label: Mello (hbtqi)
alternative label: Melodifestivalen (hbtqi)
alternative label: Schlagerfestivalen (hbtqi)
broader: Hbtqi-evenemang
in scheme: Queerlit
scope note: Används för skildringar av melodifestivaler där kopplingen till hbtqi har en framträdande betydelse.

Hinduism (hbtqi)
type: Concept
issued: 2022-05-19T10:12:00
modified: 2023-12-06T09:24:17
alternative label: Hbtqi-hinduer
alternative label: Hinduer (hbtqi)
broader: Asiatiska religioner (hbtqi)
in scheme: Queerlit
scope note: Används för skildringar av hbtqi-personer som är hinduer. Används även för skildringar av hbtqi-personers förhållningssätt till hinduism eller andra hinduers förhållningssätt till hbtqi.

Mansrörelser
type: Concept
issued: 2022-05-19T10:12:00
modified: 2022-05-19T10:12:00
broader: Sociala rörelser
hidden label: Mans-rörelser
in scheme: Queerlit
scope note: Används för skildringar av sociala rörelser som engagerar män och som verkar för mäns intressen.

Intersexrörelser
type: Concept
issued: 2022-05-19T10:12:00
modified: 2022-05-19T10:12:00
broader: Hbtqi-rörelser
hidden label: Intersex-rörelser
in scheme: Queerlit
scope note: Används för skildringar av sociala rörelser inriktade på intersexpersoners rättigheter och levnadsvillkor.

Bloggar
type: Concept
issued: 2022-05-19T10:12:00
modified: 2022-05-19T10:12:00
broader: Sociala medier
in scheme: Queerlit
scope note: Används för skildringar där bloggar - webbplatser som vanligtvis drivs av enskilda eller en liten grupp och där innehållet har en informell eller samtalsliknande stil - har betydelse för verket.

Beteendeterapi
type: Concept
issued: 2022-05-19T10:12:00
modified: 2022-05-19T10:12:00
broader: Terapier och behandlingar
hidden label: Beteende-terapi
in scheme: Queerlit
scope note: Används för skildringar av psykologisk behandling som har stort fokus på att problem orsakas av erfarenheter och där behandlingen ofta innebär att genom exponering - att närma sig det som väcker ångest eller annan negativ affekt - få möjlighet att öva nya förhållningssätt.

Halsband (BDSM)
type: Concept
issued: 2022-05-19T10:12:00
modified: 2022-05-19T10:12:00
alternative label: Collars
broader: Sexhjälpmedel
in scheme: Queerlit
scope note: Används för skildringar av halsband med koppelfunktion som används inom BDSM.

Faghags
type: Concept
issued: 2022-09-12T08:21:55
modified: 2022-09-12T08:21:55
broader: Heterosexuella kvinnor
in scheme: Queerlit
scope note: Används för skildringar av heterosexuella kvinnor som i hög grad umgås med bögar och/eller uppskattar sociala och kulturella sammanhang präglade av bögar.

Hbtqi-personer med NPF
type: Concept
issued: 2022-05-19T10:12:00
modified: 2023-12-06T09:24:17
alternative label: Hbtqi-personer med neuropsykiatriska diagnoser
alternative label: Hbtqi-personer med neuropsykiatriska funktionsnedsättningar
alternative label: Hbtqi-personer med neuropsykiatriska funktionsvariationer
alternative label: Neuroqueers
broader: Hbtqi-personer
in scheme: Queerlit
scope note: Används för skildringar av hbtqi-personer med neuropsykiatriska funktionsvariationer som exempelvis adhd, autismspektrumtillstånd och Tourettes syndrom.

Detransitionering
type: Concept
issued: 2022-05-19T10:12:00
modified: 2023-05-31T12:15:52
alternative label: Detransition
alternative label: Omtransition
alternative label: Omtransitionering
alternative label: Retransition
alternative label: Retransitionering
broader: Transitionering
hidden label: De-transitionering
in scheme: Queerlit
scope note: Används för skildringar av en könsbekräftande process som innebär en återgång till att leva med en könsidentitet en har tidigare erfarenhet av. Processen kan vara social, juridisk och/eller medicinsk.

Självinseminering
type: Concept
issued: 2022-05-19T10:12:00
modified: 2022-05-19T10:12:00
alternative label: Heminsemination
alternative label: Heminseminering
alternative label: Själv-insemination
alternative label: Själv-inseminering
alternative label: Självinsemination
broader: Inseminering
in scheme: Queerlit
scope note: Används för skildringar av inseminering utanför sjukvården, ofta i hemmet. Sperman kan komma från en donator eller partner.

Omklädningsrum
type: Concept
issued: 2022-05-19T10:12:00
modified: 2022-05-19T10:12:00
broader: Offentliga hygieninrättningar
in scheme: Queerlit
scope note: Används för skildringar där rum för att byta kläder, t.ex. i samband med idrott, har betydelse för verket.

Andra vågens feminism
type: Concept
issued: 2022-05-19T10:12:00
modified: 2022-05-19T10:12:00
alternative label: Andra vågens kvinnorörelser
alternative label: Den nya kvinnorörelsen
broader: Feminism
in scheme: Queerlit
scope note: Används för skildringar av de feministiska strömningar som etablerades under 1960- och 1970-talen, med fokus på könsrollskritik, fri abort, jämställdhet i hemmet och kvinnors rätt till sin sexualitet och sina kroppar.

Performancekonst
type: Concept
issued: 2022-05-19T10:12:00
modified: 2022-05-19T10:12:00
broader: Teater (hbtqi)
hidden label: Performance-konst
in scheme: Queerlit
scope note: Används för skildringar av performancekonst - en konstnärlig praktik som präglas av fysisk gestaltning där själva handlandet, och ofta relationen mellan konstnär och publik, utgör verket.

Offentliga duschar
type: Concept
issued: 2022-05-19T10:12:00
modified: 2022-05-19T10:12:00
broader: Offentliga hygieninrättningar
in scheme: Queerlit
scope note: Används för skildringar av duschar som är tillgängliga för allmänheten, för kunder, skolelever, anställda i ett företag eller annan liknande grupp.

Hbtqi-personer i militären
type: Concept
issued: 2022-05-19T10:12:00
modified: 2023-12-06T09:24:17
alternative label: Militärer (hbtqi)
alternative label: Soldater (hbtqi)
broader: Hbtqi-personer
in scheme: Queerlit
scope note: Används för skildringar av hbtqi-personer som är eller har varit aktiva i en organiserad krigsmakt.

Samvetsfångar (hbtqi)
type: Concept
issued: 2022-05-19T10:12:00
modified: 2023-12-06T09:24:17
alternative label: Hbtqi-samvetsfångar
broader: Fångar (hbtqi)
hidden label: Samvets-fångar (hbtqi)
in scheme: Queerlit
scope note: Används för skildringar av hbtqi-personer som fängslats på grund av sexuell läggning, könsidentitet, politiska åsikter, religion eller etnicitet.

Ortodox kristendom (hbtqi)
type: Concept
issued: 2022-05-19T10:12:00
modified: 2023-12-06T09:24:17
alternative label: Ortodoxa kristna (hbtqi)
alternative label: Ortodoxt kristna (hbtqi)
broader: Kristendom (hbtqi)
in scheme: Queerlit
scope note: Används för skildringar av hbtqi-personer som är ortodoxa kristna. Används även för skildringar av hbtqi-personers förhållningssätt till ortodox kristendom eller andra ortodoxa kristnas förhållningssätt till hbtqi.

Romer (hbtqi)
type: Concept
issued: 2022-05-19T10:12:00
modified: 2023-12-06T09:24:17
alternative label: Sinti (hbtqi)
alternative label: Zigenare (hbtqi)
broader: Etniska grupper (hbtqi)
in scheme: Queerlit
scope note: Används för skildringar av hbtqi-personer som är romer.

Hbtqi-personer med intellektuella funktionsnedsättningar
type: Concept
issued: 2022-05-19T10:12:00
modified: 2023-12-06T09:24:17
alternative label: Förståndshandikappade hbtqi-personer
alternative label: Hbtqi-personer med förståndshandikapp
alternative label: Hbtqi-personer med intellektuella funktionsvariationer
alternative label: Hbtqi-personer med utvecklingsstörning
alternative label: Intellektuellt funktionsnedsatta hbtqi-personer
alternative label: Intellektuellt funktionsvarierade hbtqi-personer
alternative label: Utvecklingsstörda hbtqi-personer
broader: Hbtqi-personer
in scheme: Queerlit
scope note: Används för skildringar av hbtqi-personer med intellektuella funktionsnedsättningar. Med intellektuella funktionsnedsättningar menas här bestående svårigheter att förstå och lära sig abstrakta, sociala och/eller praktiska saker till en grad som gör vardagslivet beroende av stöd.

Queer
type: Concept
issued: 2022-05-19T10:12:00
modified: 2023-04-26T13:57:31
broader: Hbtqi
in scheme: Queerlit
scope note: Används för skildringar med perspektiv eller teman som förstås som queera.

Självförsvar (hbtqi)
type: Concept
issued: 2022-05-19T10:12:00
modified: 2023-12-06T09:24:17
broader: Hbtqi-aktivism
in scheme: Queerlit
scope note: Används för skildringar av självförsvar för hbtqi-personer, både mot verbala och fysiska angrepp.

Hysterektomi
type: Concept
issued: 2022-05-19T10:12:00
modified: 2022-05-19T10:12:00
broader: Underlivskirurgi (transpersoner)
in scheme: Queerlit
scope note: Används för skildringar av hysterektomi, att livmodern opereras bort, exempelvis i samband med könsbekräftande behandling.

Hbtqi-personer i avvänjning
type: Concept
issued: 2022-05-19T10:12:00
modified: 2023-12-06T09:24:17
alternative label: Hbtqi-personer i 12-stegsprogram
broader: Hbtqi-personer
in scheme: Queerlit
scope note: Används för skildringar av hbtqi-personer som är i ett missbruk och strävar efter att ta sig ur det.

Offer för incest (hbtqi)
type: Concept
issued: 2022-05-19T10:12:00
modified: 2023-12-06T09:24:17
alternative label: Incestoffer (hbtqi)
broader: Offer för sexuella övergrepp (hbtqi)
in scheme: Queerlit
scope note: Används för skildringar av hbtqi-personer som utsätts för eller har utsatts för incest, vilket innebär sexuella handlingar mellan personer som är nära familj, exempelvis syskon eller förälder och barn.

Analkulor
type: Concept
issued: 2022-05-19T10:12:00
modified: 2022-05-19T10:12:00
broader: Sexhjälpmedel
in scheme: Queerlit
related: Analsex
scope note: Används för skildringar av sexuella hjälpmedel vilka består av en kedja av kulor som förs in i analöppningen.

Drogmissbruk (hbtqi)
type: Concept
issued: 2022-05-19T10:12:00
modified: 2023-12-06T09:24:17
alternative label: Drogberoende hos hbtqi-personer
alternative label: Drogmissbruk hos hbtqi-personer
alternative label: Drogmissbrukande hbtqi-personer
alternative label: Hbtqi-personer med drogberoende
alternative label: Hbtqi-personer med drogmissbruk
alternative label: Hbtqi-personer som lever i drogberoende
alternative label: Hbtqi-personer som lever i drogmissbruk
alternative label: Hbtqi-personer som missbrukar droger
alternative label: Hbtqi-personer som missbrukar knark
alternative label: Hbtqi-personer som är beroende av droger
alternative label: Hbtqi-personer som är beroende av knark
alternative label: Narkomani hos hbtqi-personer
alternative label: Narkotikaberoende hos hbtqi-personer
alternative label: Narkotikamissbruk hos hbtqi-personer
broader: Substansmissbruk (hbtqi)
in scheme: Queerlit
related: Droganvändning (hbtqi)
scope note: Används för skildringar där hbtqi-personer missbrukar eller är beroende av droger. Med missbruk menas här sådant bruk som skadar hälsa och relationer.

Bordeller
type: Concept
issued: 2022-05-19T10:12:00
modified: 2022-05-19T10:12:00
alternative label: Glädjehus
alternative label: Horhus
broader: Sexindustri
in scheme: Queerlit
related: Prostitution
scope note: Används för skildringar av lokaler där organiserad prostitution bedrivs av fler än en person.

Neovaginor
type: Concept
issued: 2022-05-19T10:12:00
modified: 2022-05-19T10:12:00
alternative label: Erhållen fitta
alternative label: Erhållen vagina
alternative label: Neofitta
broader: Vaginor
in scheme: Queerlit
related: Vaginoplastik
scope note: Används för skildringar av vaginor skapade genom kirurgi på någon som tidigare saknat vagina.

Obesvarad kärlek (hbtqi)
type: Concept
issued: 2022-05-19T10:12:00
modified: 2023-12-06T09:24:17
broader: Kärlek (hbtqi)
in scheme: Queerlit
related: Kär i kompis (hbtqi)
scope note: Används för skildringar av obesvarad kärlek där hbtqi-personer har en framträdande betydelse.

Unga transmän
type: Concept
issued: 2022-09-13T11:22:43
modified: 2022-09-13T11:22:43
alternative label: Manliga transtonåringar
alternative label: Manliga transungdomar
broader: Transmän
broader: Unga transpersoner
in scheme: Queerlit
scope note: Används för skildringar av ungdomar som beskrivs som transmän.

Mammor till bisexuella
type: Concept
issued: 2022-05-19T10:12:00
modified: 2022-06-07T15:09:28
alternative label: Bisexuellas mammor
alternative label: Bisexuellas mödrar
alternative label: Mödrar till bisexuella
broader: Mammor till hbtqi-personer
broader: Föräldrar till bisexuella
in scheme: Queerlit
scope note: Används för skildringar av mammor till bisexuella, oavsett mammans egen identitet.

Disciplinbollar
type: Concept
issued: 2022-05-19T10:12:00
modified: 2022-05-19T10:12:00
alternative label: Ballgags
alternative label: Bollgag
alternative label: Gag-boll
broader: Sexhjälpmedel
in scheme: Queerlit
related: BDSM
scope note: Används för skildringar av en form av munkavel använd inom BDSM.

Sorg (hbtqi)
type: Concept
issued: 2022-05-19T10:12:00
modified: 2023-12-06T09:24:17
broader: Känslor (hbtqi)
in scheme: Queerlit
related: Döden och döende (hbtqi)
scope note: Används för skildringar där sorg som involverar hbtqi-personer har betydelse för verket.

Mammor till intersexpersoner
type: Concept
issued: 2022-05-19T10:12:00
modified: 2024-03-19T10:00:33
alternative label: Intersexpersoners mammor
alternative label: Intersexpersoners mödrar
alternative label: Mödrar till intersexpersoner
broader: Mammor till hbtqi-personer
broader: Föräldrar till intersexpersoner
in scheme: Queerlit
scope note: Används för skildringar av mammor till intersexpersoner, oavsett mammans egen identitet.

Hbtqi-personer med synnedsättning
type: Concept
issued: 2022-05-19T10:12:00
modified: 2023-12-06T09:24:17
alternative label: Personer med synnedsättning (hbtqi)
broader: Fysiskt funktionshindrade hbtqi-personer
in scheme: Queerlit
narrower: Blinda hbtqi-personer
scope note: Används för skildringar av hbtqi-personer med synnedsättning, där synnedsättningen har betydelse för hur de porträtteras i verket.

Transseparatism
type: Concept
issued: 2022-05-19T10:12:00
modified: 2022-05-19T10:12:00
broader: Könsöverskridanden
broader: Hbtqi-separatism
hidden label: Trans-separatism
in scheme: Queerlit
scope note: Används för skildringar av frivillig ideologisk, social, kulturell och ibland fysisk separation av transpersoner från cispersoner.

Vulvor
type: Concept
issued: 2022-05-19T10:12:00
modified: 2022-05-19T10:12:00
broader: Könsorgan
broader: Erogena zoner
in scheme: Queerlit
scope note: Används för skildringar av de yttre delarna av fittan så som venusberg, blygdläppar och klitoris.

Lersex
type: Concept
issued: 2022-05-19T10:12:00
modified: 2022-05-19T10:12:00
broader: Sexuella praktiker
broader: Sex
in scheme: Queerlit
scope note: Används för skildringar av sex som involverar lera.

Äldre bisexuella kvinnor
type: Concept
issued: 2022-05-19T10:12:00
modified: 2024-03-19T10:00:33
alternative label: Gamla bisexuella kvinnor
broader: Bisexuella kvinnor
broader: Äldre bisexuella
in scheme: Queerlit
scope note: Används för skildringar av äldre personer som beskrivs som bisexuella kvinnor.

Partners till transvestiter
type: Concept
issued: 2022-05-19T10:12:00
modified: 2023-03-29T10:25:38
alternative label: Partners till crossdressers
broader: Partners till transpersoner
in scheme: Queerlit
related: Transvestiter
scope note: Används för skildringar av personer som är partners till transvestiter, oavsett partnerns egen identitet.

Primära partners
type: Concept
issued: 2022-05-19T10:12:00
modified: 2022-05-19T10:12:00
alternative label: Huvudsakliga partners
alternative label: Primärpartners
broader: Partners (hbtqi)
in scheme: Queerlit
related: Hierarkisk icke-monogami
scope note: Används för skildringar av den partner i hierarkiskt polyamorösa förhållanden vars intressen och önskemål kommer före en eller flera sekundära partners.

Lädermän
type: Concept
issued: 2022-05-19T10:12:00
modified: 2023-03-29T10:53:01
broader: Lädergemenskaper
hidden label: Läder-bögar
hidden label: Läder-män
hidden label: Läderbögar
in scheme: Queerlit
narrower: Läderpappor
scope note: Används för skildringar av män som är en del av lädergemenskaper.

Strippor
type: Concept
issued: 2022-05-19T10:12:00
modified: 2024-09-05T13:44:36
alternative label: Strippare
alternative label: Stripteasedansare
alternative label: Stripteasedansöser
alternative label: Stripteasers
broader: Sexarbetare (hbtqi)
in scheme: Queerlit
related: Striptease
scope note: Används för skildringar av personer som arbetar med striptease - att dansa erotiskt och samtidigt klä av sig.

Mammor till queera personer
type: Concept
issued: 2022-05-19T10:12:00
modified: 2023-05-31T12:15:52
alternative label: Mödrar till queera personer
alternative label: Queera personers mammor
alternative label: Queera personers mödrar
broader: Mammor till hbtqi-personer
broader: Föräldrar till queera personer
in scheme: Queerlit
scope note: Används för skildringar av mammor till queera personer, oavsett mammans egen identitet.

Asiater (hbtqi)
type: Concept
issued: 2022-05-19T10:12:00
modified: 2023-12-06T09:24:17
broader: Icke-vita hbtqi-personer
broader: Etniska grupper (hbtqi)
in scheme: Queerlit
scope note: Används för skildringar av hbtqi-personer med eget eller historiskt ursprung i Asien.

Mammor till lesbiska
type: Concept
issued: 2022-05-19T10:12:00
modified: 2022-05-19T10:12:00
alternative label: Lesbiskas mammor
alternative label: Lesbiskas mödrar
alternative label: Mödrar till lesbiska
broader: Mammor till homosexuella
broader: Föräldrar till lesbiska
in scheme: Queerlit
scope note: Används för skildringar av mammor till lesbiska, oavsett mammans egen identitet.

Heterosexuella pojkar
type: Concept
issued: 2022-05-19T10:12:00
modified: 2022-05-19T10:12:00
broader: Heterosexuella barn
broader: Pojkar
in scheme: Queerlit
scope note: Används för skildringar av heterosexuella pojkar. Ämnesordet används för skildringar där identiteten som heterosexuell är i fokus.

Unga bisexuella män
type: Concept
issued: 2022-09-13T11:22:43
modified: 2022-09-13T11:22:43
alternative label: Manliga bisexuella tonåringar
alternative label: Manliga bisexuella ungdomar
broader: Bisexuella män
broader: Unga bisexuella
in scheme: Queerlit
scope note: Används för skildringar av ungdomar som beskrivs som bisexuella män.

Partners till bögar
type: Concept
issued: 2022-05-19T10:12:00
modified: 2023-03-29T10:25:38
broader: Partners till homosexuella
in scheme: Queerlit
related: Bögar
scope note: Används för skildringar av personer som är partners till bögar, oavsett partnerns egen identitet.

Transpar
type: Concept
issued: 2022-05-19T10:12:00
modified: 2022-06-07T15:09:28
broader: Hbtqi-par
broader: Transpersoner
hidden label: Trans-par
in scheme: Queerlit
scope note: Används för skildringar av parrelationer mellan transpersoner.

Förföljelse av bisexuella
type: Concept
issued: 2022-05-19T10:12:00
modified: 2022-05-19T10:12:00
broader: Förföljelse av hbtqi-personer
in scheme: Queerlit
related: Bisexuella
scope note: Används för skildringar av förföljelse av bisexuella på grund av deras sexuella läggning.

Rimming
type: Concept
issued: 2022-05-19T10:12:00
modified: 2022-05-19T10:12:00
alternative label: Anilingus
alternative label: Rimning
broader: Analsex
broader: Slicksex
in scheme: Queerlit
scope note: Används för skildringar av oralsex där anus stimuleras med hjälp av mun och tunga.

Prostituerade intersexpersoner
type: Concept
issued: 2022-05-19T10:12:00
modified: 2022-06-07T15:09:28
broader: Prostituerade
broader: Intersexpersoner
in scheme: Queerlit
scope note: Används för skildringar av intersexpersoner som säljer eller har sålt sexuella tjänster.

Okönade unga
type: Concept
issued: 2022-05-19T10:12:00
modified: 2022-05-19T10:12:00
alternative label: Okönade ungdomar
broader: Okönade personer
broader: Ungdomar
in scheme: Queerlit
scope note: Används för skildringar av ungdomar vars könstillhörighet inte framgår, och där detta har betydelse för verket.

Missnöje med egen sexuell läggning
type: Concept
issued: 2022-05-19T10:12:00
modified: 2022-05-19T10:12:00
alternative label: Egodyston asexualitet
alternative label: Egodyston bisexualitet
alternative label: Egodyston heterosexualitet
alternative label: Egodyston homosexualitet
alternative label: Egodyston sexuell läggning
alternative label: Egodyston sexuell orientering
broader: Psykisk ohälsa
in scheme: Queerlit
related: Sexuell omvändelse
scope note: Används för skildringar av djupt missnöje med sin egen sexuella läggning.

Förtalskampanjer (hbtqi)
type: Concept
issued: 2022-05-19T10:12:00
modified: 2023-12-06T09:24:17
alternative label: Smutskastningskampanjer (hbtqi)
broader: Förföljelse av hbtqi-personer
hidden label: Förtals-kampanjer (hbtqi)
in scheme: Queerlit
related: Ryktesspridning (hbtqi)
scope note: Används för skildringar av förtalskampanjer gentemot hbtqi-personer, riktat mot deras identitet och/eller livsstil.

Suicid (hbtqi)
type: Concept
issued: 2022-05-19T10:12:00
modified: 2023-12-06T09:24:17
alternative label: Självmord (hbtqi)
broader: Döden och döende (hbtqi)
in scheme: Queerlit
related: Psykiatrisk vård (hbtqi)
scope note: Används för skildringar av hbtqi-personers suicid, suicidförsök samt suicidtankar.

Stockholmare (hbtqi)
type: Concept
issued: 2022-05-19T10:12:00
modified: 2023-12-06T09:24:17
broader: Historiska termer (hbtqi)
in scheme: Queerlit
related: Homosexuella
scope note: Används för skildringar, historiska eller historiserande, som använder begreppet stockholmare för att referera till personer som antas vara homosexuella. Ämnesordet används inte allmänt för hbtqi-personer som bor i Stockholm.

Fängelsestraff (hbtqi)
type: Concept
issued: 2022-05-19T10:12:00
modified: 2023-12-06T09:24:17
broader: Frihetsberövande av hbtqi-personer
hidden label: Fängelse-straff (hbtqi)
in scheme: Queerlit
related: Fångar (hbtqi)
scope note: Används för skildringar av fängelsestraff där kopplingen till hbtqi har en framträdande betydelse.

Hbtqi-klubbar
type: Concept
issued: 2022-05-19T10:12:00
modified: 2023-12-06T09:24:17
alternative label: Gay-discon
alternative label: Gay-diskotek
alternative label: Gay-nattklubbar
alternative label: Gayklubbar
alternative label: Hbtqi-discon
broader: Uteliv (hbtqi)
in scheme: Queerlit
related: Hbtqi-barer
scope note: Används för skildringar av nattklubbar vars målgrupp främst är hbtqi-personer.

Intimitet (hbtqi)
type: Concept
issued: 2022-05-19T10:12:00
modified: 2024-03-19T10:00:33
broader: Känslor (hbtqi)
in scheme: Queerlit
related: Kroppslig närhet
scope note: Används för skildringar där personlig närhet, både fysisk och emotionell, som involverar hbtqi-personer har betydelse för verket.

Pappor till bisexuella
type: Concept
issued: 2022-05-19T10:12:00
modified: 2022-06-07T15:09:28
alternative label: Bisexuellas fäder
alternative label: Bisexuellas pappor
alternative label: Fäder till bisexuella
broader: Pappor till hbtqi-personer
broader: Föräldrar till bisexuella
in scheme: Queerlit
scope note: Används för skildringar av pappor till bisexuella, oavsett pappans egen identitet.

Prostituerade bisexuella
type: Concept
issued: 2022-05-19T10:12:00
modified: 2022-06-07T15:09:28
broader: Prostituerade
broader: Bisexuella
in scheme: Queerlit
scope note: Används för skildringar av bisexuella som säljer eller har sålt sexuella tjänster.

Prygel
type: Concept
issued: 2022-05-19T10:12:00
modified: 2022-05-19T10:12:00
alternative label: Flagellation
alternative label: Gissling
alternative label: Prygling
broader: SM
in scheme: Queerlit
related: Piskor
scope note: Används för skildringar av slag och piskning som en del i BDSM-sex.

Unga lesbiska
type: Concept
issued: 2022-05-19T10:12:00
modified: 2022-06-07T15:09:28
alternative label: Lesbiska tonåringar
broader: Lesbiska
broader: Unga homosexuella
in scheme: Queerlit
scope note: Används för skildringar av ungdomar som beskrivs som lesbiska.

Bröstförstoring
type: Concept
issued: 2022-05-19T10:12:00
modified: 2023-03-29T10:53:01
alternative label: Bröstaugmentation
broader: Könsbekräftande behandling
hidden label: Bröst-augmentation
hidden label: Bröst-förstoring
in scheme: Queerlit
related: Bröst
scope note: Används för skildringar av operationer för att öka bröststorleken med hjälp av implantat - kan vara en del av könsbekräftande kirurgi för transkvinnor.

Internetsexarbetare (hbtqi)
type: Concept
issued: 2023-12-06T09:24:17
modified: 2023-12-06T09:24:17
alternative label: Camsexarbetare
alternative label: Camsexsäljare
alternative label: Cybersexarbetare
alternative label: Cybersexsäljare
alternative label: Internetsexsäljare
alternative label: Nätsexarbetare
alternative label: Nätsexsäljare
broader: Sexarbetare (hbtqi)
hidden label: Camsex-arbetare
hidden label: Camsex-säljare
hidden label: Cybersex-arbetare
hidden label: Cybersex-säljare
hidden label: Internet-sexarbetare
hidden label: Internetsex-säljare
hidden label: Nätsex-arbetare
hidden label: Nätsex-säljare
in scheme: Queerlit
related: Cybersex
scope note: Används för skildringar av personer som arbetar med att posera sexuellt över internet. Ämnesordet används där kopplingen till hbtqi har en framträdande betydelse.

Dekadens
type: Concept
issued: 2022-05-19T10:12:00
modified: 2024-09-05T13:44:36
broader: Subkulturer
in scheme: Queerlit
related: Sexuell identitet
scope note: Används för skildringar av en livsstil präglad av manér, världsleda och överdrift, som ofta betraktas som uttryck för moraliskt förfall av mer konservativa personer.

Äldre lesbiska
type: Concept
issued: 2022-05-19T10:12:00
modified: 2024-03-19T10:00:33
alternative label: Gamla homosexuella kvinnor
alternative label: Gamla lesbiska
alternative label: Äldre homosexuella kvinnor
broader: Äldre homosexuella
broader: Lesbiska
in scheme: Queerlit
scope note: Används för skildringar av äldre personer som beskrivs som lesbiska.

Mammor till bögar
type: Concept
issued: 2022-05-19T10:12:00
modified: 2022-05-19T10:12:00
alternative label: Bögars mammor
alternative label: Bögars mödrar
alternative label: Mödrar till bögar
broader: Föräldrar till bögar
broader: Mammor till homosexuella
in scheme: Queerlit
scope note: Används för skildringar av mammor till bögar, oavsett mammans egen identitet.

Mastektomi
type: Concept
issued: 2022-05-19T10:12:00
modified: 2022-05-19T10:12:00
alternative label: Bröstborttagning
alternative label: Bröstförminskning
broader: Könsbekräftande behandling
in scheme: Queerlit
related: Bröst
scope note: Används för skildringar av operationer för att minska bröststorleken eller helt ta bort bröstvävnaden - kan vara en del av könsbekräftande kirurgi för transmän och ickebinära.

Bögkörer
type: Concept
issued: 2022-05-19T10:12:00
modified: 2023-03-29T10:53:01
alternative label: Gaykörer
broader: Körer (hbtqi)
hidden label: Bög-körer
in scheme: Queerlit
related: Lesbiska körer
scope note: Används för skildringar av körer bestående av främst bögar.

Skandaler (hbtqi)
type: Concept
issued: 2022-05-19T10:12:00
modified: 2023-12-06T09:24:17
alternative label: Hbtqi-skandaler
alternative label: Sexskandaler (hbtqi)
broader: Sociala processer (hbtqi)
hidden label: Sex-skandaler (hbtqi)
in scheme: Queerlit
related: Sociala processer (hbtqi)
scope note: Används för skildringar av negativ offentlig uppmärksamhet rörande hbtqi-personer eller föreställningar om samkönade sexuella praktiker, känslor, identiteter och/eller överskridanden av binära könsnormer.

Perverterade
type: Concept
issued: 2023-12-13T10:57:15
modified: 2023-12-13T10:57:15
alternative label: Peve
alternative label: Sexualperverterade
alternative label: Sexuellt perverterade
broader: Historiska termer (hbtqi)
in scheme: Queerlit
related: Homosexuella
scope note: Används för skildringar, historiska eller historiserande, som använder begreppet perverterade - ett äldre ord som syftar på en föreställd snedvridning av förväntade sexuella begär eller handlingar hos en person. Historiskt har begreppet främst använts för att beskriva personer med samkönad begärsriktning, men förekommer även som beskrivning av exempelvis fetischister eller sexualbrottslingar.

Vård i livets slutskede (aids)
type: Concept
issued: 2022-05-19T10:12:00
modified: 2022-05-19T10:12:00
alternative label: Palliation (aids)
alternative label: Palliativ vård (aids)
alternative label: Palliativt skeende (aids)
alternative label: Vård av döende (aids)
broader: Hälso- och sjukvård (hbtqi)
in scheme: Queerlit
related: Döden och döende (hbtqi)
scope note: Används för skildringar av vård av personer döende i aidsrelaterade sjukdomar.

Hemlösa hbtqi-ungdomar
type: Concept
issued: 2022-05-19T10:12:00
modified: 2023-12-06T09:24:17
broader: Hbtqi-ungdomar
broader: Hemlösa hbtqi-personer
in scheme: Queerlit
scope note: Används för skildringar av hbtqi-ungdomar som lever i hemlöshet. Hemlöshet innebär att personen saknar en fast bostad i en kultur där fast bostad är norm.

Pappor till intersexpersoner
type: Concept
issued: 2022-05-19T10:12:00
modified: 2024-03-19T10:00:33
alternative label: Fäder till intersexpersoner
alternative label: Intersexpersoners fäder
alternative label: Intersexpersoners pappor
broader: Pappor till hbtqi-personer
broader: Föräldrar till intersexpersoner
in scheme: Queerlit
scope note: Används för skildringar av pappor till intersexpersoner, oavsett pappans egen identitet.

Ensamstående pappor (hbtqi)
type: Concept
issued: 2022-05-19T10:12:00
modified: 2023-12-06T09:24:17
broader: Pappor
broader: Ensamstående föräldrar (hbtqi)
in scheme: Queerlit
scope note: Används för skildringar av pappor som är hbtqi-personer och som lever ensamma med barn och har ensam eller delad vårdnad där barnen bor hos pappan på minst halvtid.

Elbehandling
type: Concept
issued: 2022-05-19T10:12:00
modified: 2023-12-06T09:24:17
alternative label: ECT
alternative label: Elchocker
alternative label: Elchocksbehandling
alternative label: Elektrokonvulsiv terapi
broader: Terapier och behandlingar
in scheme: Queerlit
related: Tvångsvård av hbtqi-personer
scope note: Används för skildringar av psykiatrisk elbehandling. Elbehandling innebär att epileptisk aktivitet framkallas i hjärnan med hjälp av elektrisk ström. För skildringar av att med elstötar orsaka negativa associationer till samkönat begär eller könsöverskridande, använd ämnesordet "Aversionsterapi (hbtqi)".

Hierarkisk icke-monogami
type: Concept
issued: 2022-05-19T10:12:00
modified: 2022-05-19T10:12:00
alternative label: Hierarkisk polyamori
broader: Polyamori
in scheme: Queerlit
related: Primära partners
scope note: Används för skildringar av överenskommen icke-monogami där de inblandade kan ha flera partners som prioriteras olika vad gäller t.ex. umgängestid, känslomässig intensitet och/eller ekonomisk delaktighet.

Prostituerade transpersoner
type: Concept
issued: 2022-05-19T10:12:00
modified: 2022-06-07T15:09:28
broader: Prostituerade
broader: Transpersoner
in scheme: Queerlit
scope note: Används för skildringar av transpersoner som säljer eller har sålt sexuella tjänster.

Förföljelse av transpersoner
type: Concept
issued: 2022-05-19T10:12:00
modified: 2022-05-19T10:12:00
broader: Förföljelse av hbtqi-personer
in scheme: Queerlit
related: Transpersoner
scope note: Används för skildringar av förföljelse av transpersoner på grund av deras könsidentitet och/eller könsuttryck.

Vulvasmärtor
type: Concept
issued: 2022-05-19T10:12:00
modified: 2022-05-19T10:12:00
alternative label: Slidkramp
alternative label: Vaginism
alternative label: Vestibulit
alternative label: Vulvodyni
broader: Sexuell dysfunktion
in scheme: Queerlit
related: Vaginor
scope note: Används för skildringar av smärtor i vulvan vid beröring och sex.

Mammor till transmän
type: Concept
issued: 2023-12-13T10:57:15
modified: 2023-12-13T10:57:15
alternative label: Mödrar till transmän
alternative label: Mödrar till transpojkar
alternative label: Transmän mammor
alternative label: Transmäns mödrar
alternative label: Transpojkars mammor
alternative label: Transpojkars mödrar
broader: Mammor till transpersoner
broader: Föräldrar till transmän
in scheme: Queerlit
scope note: Används för skildringar av mammor till transmän, oavsett mammans egen identitet.

Barnbarn
type: Concept
issued: 2022-05-19T10:12:00
modified: 2022-06-22T14:37:20
broader: Familjemedlemmar
in scheme: Queerlit
related: Mor- och farföräldrar
scope note: Används för skildringar av barnbarn.

Bögrörelser
type: Concept
issued: 2022-05-19T10:12:00
modified: 2023-03-29T10:53:01
alternative label: Bögorganisationer
alternative label: Organisationer för bögar
broader: Homosexuella rörelser
hidden label: Bög-rörelser
in scheme: Queerlit
related: Hbtqi-frigörelse
scope note: Används för skildringar av sociala rörelser inriktade på bögars rättigheter och levnadsvillkor.

Barebacking
type: Concept
issued: 2022-05-19T10:12:00
modified: 2022-05-19T10:12:00
alternative label: Barbackasex
broader: Anala samlag
broader: Sexuella riskbeteenden
in scheme: Queerlit
scope note: Används för skildringar av anala samlag utan kondom.

TV (hbtqi)
type: Concept
issued: 2022-05-19T10:12:00
modified: 2023-12-06T09:24:17
alternative label: Television (hbtqi)
in scheme: Queerlit
scope note: Används för skildringar av TV-produktioner som riktar sig till och/eller handlar om hbtqi-personer.
top concept of: Queerlit

Musikaler
type: Concept
issued: 2022-05-19T10:12:00
modified: 2022-05-19T10:12:00
in scheme: Queerlit
scope note: Används för skildringar av musikaler. Används ej för verk som är musikaler.
top concept of: Queerlit

Motorcykelklubbar (hbtqi)
type: Concept
issued: 2022-05-19T10:12:00
modified: 2023-12-06T09:24:17
alternative label: MC-klubbar (hbtqi)
broader: Hbtqi-föreningar
hidden label: Motorcykel-klubbar (hbtqi)
in scheme: Queerlit
related: Dykes on bikes
scope note: Används för skildringar av motorcykelklubbar där kopplingen till hbtqi har en framträdande betydelse.

Dandyism
type: Concept
issued: 2022-05-19T10:12:00
modified: 2022-05-19T10:12:00
broader: Subkulturer
in scheme: Queerlit
related: Dandyer
scope note: Används för skildringar av dandyism, en livsstil och subkultur som präglas av raffinemang, världsvana och elegans, oftast förknippad med män som kan betraktas som "feminina".

Sexbutiker
type: Concept
issued: 2022-05-19T10:12:00
modified: 2023-04-05T12:12:25
alternative label: Porrbutiker
alternative label: Sexshoppar
broader: Sexindustri
hidden label: Porr-butiker
hidden label: Sex-butiker
in scheme: Queerlit
related: Sexhjälpmedel
scope note: Används för skildringar av butiker där sexhjälpmedel och/eller pornografi kan köpas.

Travesti
type: Concept
issued: 2022-05-19T10:12:00
modified: 2022-05-19T10:12:00
broader: Könsöverskridanden
broader: Könsidentitet
in scheme: Queerlit
scope note: Används för skildringar av transkvinnor i Sydamerika som beskrivs som travesti.

Samvetsäktenskap
type: Concept
issued: 2022-05-19T10:12:00
modified: 2023-03-29T10:53:01
alternative label: Common law marriage
alternative label: Stockholmsäktenskap
broader: Äktenskapslagstiftning
broader: Äktenskap
hidden label: Samvets-äktenskap
in scheme: Queerlit
scope note: Används för skildringar där begreppet - en äldre svensk term för samboförhållande utan giftermål - brukas. I den engelskspråkiga världen används motsvarande begrepp fortfarande som juridisk term.

Partners till bisexuella
type: Concept
issued: 2022-05-19T10:12:00
modified: 2023-03-29T10:25:38
broader: Partners (hbtqi)
in scheme: Queerlit
related: Bisexuella
scope note: Används för skildringar av personer som är partners till bisexuella, oavsett partnerns egen identitet.

Unga ickebinära
type: Concept
issued: 2022-05-19T10:12:00
modified: 2024-09-05T13:44:36
alternative label: Ickebinära ungdomar
broader: Unga transpersoner
broader: Ickebinära personer
in scheme: Queerlit
scope note: Används för skildringar av ungdomar som beskrivs som ickebinära.

Antik symbolik (hbtqi)
type: Concept
issued: 2022-05-19T10:12:00
modified: 2023-12-06T09:24:17
broader: Symbolik (hbtqi)
in scheme: Queerlit
related: Amasoner
scope note: Används för skildringar där symbolik från antika kultursfärer används för att signalera samkönade sexuella praktiker, känslor, identiteter och/eller överskridanden av binära könsnormer. Med antika kultursfärer avses de traditioner under perioden ca. 800 f.v.t. till ca. 500 e.v.t. som påverkades av de grekiska stadsstaterna och/eller Romarriket.

Äldre transmän
type: Concept
issued: 2022-09-13T11:22:43
modified: 2022-09-13T11:22:43
alternative label: Gamla transmän
broader: Äldre transpersoner
broader: Transmän
in scheme: Queerlit
scope note: Används för skildringar av äldre personer som beskrivs som transmän.

Aids-minnesmärken
type: Concept
issued: 2022-05-19T10:12:00
modified: 2022-05-19T10:12:00
alternative label: AIDS Memorial Quilt
broader: Hbtqi-minnesmärken
in scheme: Queerlit
related: Hiv/aids
scope note: Används för skildringar av minnesmärken för personer som drabbats och dött av aidsrelaterade sjukdomar, eller monument som mer allmänt synliggör hiv-/aidsepidemin.

Heterosexuella män
type: Concept
issued: 2022-05-19T10:12:00
modified: 2022-05-19T10:12:00
broader: Heterosexuella
broader: Män
in scheme: Queerlit
scope note: Används för skildringar av heterosexuella män. Ämnesordet används för skildringar där identiteten som heterosexuell är i fokus.

Pappor till transmän
type: Concept
issued: 2023-12-13T10:57:15
modified: 2023-12-13T10:57:15
alternative label: Fäder till transmän
alternative label: Fäder till transpojkar
alternative label: Pappor till transkvinnor
alternative label: Transmäns fäder
alternative label: Transmäns pappor
alternative label: Transpojkars fäder
alternative label: Transpojkars pappor
broader: Föräldrar till transmän
broader: Pappor till transpersoner
in scheme: Queerlit
scope note: Används för skildringar av pappor till transmän, oavsett pappans egen identitet.

Censur
type: Concept
issued: 2022-05-19T10:12:00
modified: 2022-05-19T10:12:00
in scheme: Queerlit
scope note: Används för skildringar av myndigheters och/eller staters granskande och eventuella förbud gentemot innehåll i exempelvis böcker, tidningar, musik och rörlig bild.
top concept of: Queerlit

Lobbning (hbtqi)
type: Concept
issued: 2022-05-19T10:12:00
modified: 2023-12-06T09:24:17
alternative label: Hbtqi-lobbning
alternative label: Hbtqi-lobbying
alternative label: Lobbying (hbtqi)
alternative label: Påverkansarbete (hbtqi)
broader: Hbtqi-aktivism
in scheme: Queerlit
related: Juridik
scope note: Används för skildringar av politiskt påtryckningsarbete i hbtqi-frågor gentemot beslutsfattare.

Aktionskampanjer (hbtqi)
type: Concept
issued: 2022-05-19T10:12:00
modified: 2023-12-06T09:24:17
broader: Hbtqi-aktivism
hidden label: Aktions-kampanjer (hbtqi)
in scheme: Queerlit
narrower: Ockupationen av Socialstyrelsen 1979
scope note: Används för skildringar av kampanjer som syftar till att synliggöra och stärka hbtqi-personer, eller verka för samhällelig förändring till förmån för hbtqi-personer.

Unga transkvinnor
type: Concept
issued: 2022-09-13T11:22:43
modified: 2022-09-13T11:22:43
alternative label: Kvinnliga transtonåringar
alternative label: Kvinnliga transungdomar
broader: Unga transpersoner
broader: Transkvinnor
in scheme: Queerlit
scope note: Används för skildringar av ungdomar som beskrivs som transkvinnor.

Genderfluid-personer
type: Concept
issued: 2022-05-19T10:12:00
modified: 2022-06-07T15:09:28
broader: Transpersoner
in scheme: Queerlit
related: Bigender-personer
scope note: Används för skildringar av personer som beskrivs som genderfluid - med en könsidentitet som kan växla mellan eller vara en dynamisk blandning av olika kön eller frånvaro av kön.

Äldre bögar
type: Concept
issued: 2022-05-19T10:12:00
modified: 2024-03-19T10:00:33
alternative label: Gamla bögar
alternative label: Gamla homosexuella män
alternative label: Äldre homosexuella män
broader: Äldre homosexuella
broader: Bögar
in scheme: Queerlit
scope note: Används för skildringar av äldre personer som beskrivs som bögar.

Förläggare (hbtqi)
type: Concept
issued: 2022-05-19T10:12:00
modified: 2023-12-06T09:24:17
in scheme: Queerlit
scope note: Används för skildringar av förläggare som ger ut litteratur av hbtqi-personer, eller som själva är hbtqi-personer.
top concept of: Queerlit

PrEP
type: Concept
issued: 2022-05-19T10:12:00
modified: 2023-03-29T10:25:38
alternative label: Pre-exposure prophylaxis
alternative label: Preexpositionsprofylax
broader: Läkemedel
hidden label: Pre-expositions-profylax
hidden label: Pre-expositionsprofylax
hidden label: Preexpositions-profylax
in scheme: Queerlit
related: Hiv/aids
scope note: Används för skildringar där läkemedel med syfte att förebygga hivinfektion har betydelse för verket.

Medpappor (hbtqi)
type: Concept
issued: 2022-05-19T10:12:00
modified: 2023-12-06T09:24:17
broader: Medföräldrar (hbtqi)
broader: Pappor
hidden label: Med-pappor (hbtqi)
in scheme: Queerlit
scope note: Används för skildringar av hbtqi-familjer som innefattar medpappor - pappor som de andra föräldrarna inte har, eller haft, en romantisk relation med.

Hbtqi-sportevenemang
type: Concept
issued: 2022-05-19T10:12:00
modified: 2024-03-19T10:08:14
alternative label: EuroGames
alternative label: Gay Games
alternative label: Outgames
broader: Hbtqi-evenemang
in scheme: Queerlit
related: Idrottare (hbtqi)
scope note: Används för skildringar av sportevenemang där kopplingen till hbtqi har en framträdande betydelse.

Heterofeminism
type: Concept
issued: 2022-05-19T10:12:00
modified: 2022-05-19T10:12:00
alternative label: Heterosexuell feminism
broader: Feminism
in scheme: Queerlit
related: Lesbisk feminism
scope note: Används för skildringar av feminism enbart fokuserad på heterosexuella kvinnors villkor.

Radio (hbtqi)
type: Concept
issued: 2022-05-19T10:12:00
modified: 2023-12-06T09:24:17
alternative label: Gayradio
in scheme: Queerlit
scope note: Används för skildringar av radio där kopplingen till hbtqi har en framträdande betydelse.
top concept of: Queerlit

Sexterapi
type: Concept
issued: 2022-05-19T10:12:00
modified: 2022-05-19T10:12:00
broader: Terapier och behandlingar
hidden label: Sex-terapi
in scheme: Queerlit
related: Sexuell dysfunktion
scope note: Används för skildringar av rådgivning och samtal med syfte att hjälpa personer att lösa sexuella svårigheter.

Maskuliniserande crossdressing
type: Concept
issued: 2022-09-12T08:21:55
modified: 2022-09-12T08:21:55
broader: Crossdressing
in scheme: Queerlit
related: Transmaskulina
scope note: Används för skildringar av crossdressing med maskulint kodade kläder.

Prostituerade män
type: Concept
issued: 2022-05-19T10:12:00
modified: 2024-09-05T13:44:36
alternative label: Bögkörare
alternative label: Bögsnoare
alternative label: Call boys
alternative label: Gigolos
alternative label: Manliga prostituerade
alternative label: Money boys
broader: Prostituerade
in scheme: Queerlit
narrower: Prostituerade bögar
scope note: Används för skildringar av män som säljer eller har sålt sexuella tjänster.

Äldre queera personer
type: Concept
issued: 2022-05-19T10:12:00
modified: 2024-03-19T10:00:33
alternative label: Gamla queera personer
broader: Äldre hbtqi-personer
broader: Queera personer
in scheme: Queerlit
scope note: Används för skildringar av äldre personer som beskrivs som queera.

Machokultur
type: Concept
issued: 2022-05-19T10:12:00
modified: 2022-05-19T10:12:00
alternative label: Hypermaskulinitet
alternative label: Machismo
broader: Könsroller
in scheme: Queerlit
related: Maskulinitet
scope note: Används för skildringar av en förtryckande manlighetskultur där manligt beteende inkluderar sexistiska inslag.

Äldre ickebinära
type: Concept
issued: 2022-11-23T07:43:01
modified: 2022-11-23T07:43:01
alternative label: Gamla ickebinära
broader: Äldre transpersoner
broader: Ickebinära personer
in scheme: Queerlit
scope note: Används för skildringar av äldre personer som beskrivs som ickebinära.

Äldre heterosexuella
type: Concept
issued: 2022-05-19T10:12:00
modified: 2024-03-19T10:00:33
alternative label: Gamla heterosexuella
broader: Äldre
broader: Heterosexuella
in scheme: Queerlit
scope note: Används för skildringar av äldre personer som beskrivs som heterosexuella.

Könskörtlar
type: Concept
issued: 2022-05-19T10:12:00
modified: 2022-05-19T10:12:00
broader: Biologiskt kön
in scheme: Queerlit
narrower: Testiklar
scope note: Används för skildringar där de hormonkörtlar som i regel tillverkar könsceller och könshormoner, d.v.s. testiklar och äggstockar, har betydelse för verket.

Antigaylagar
type: Concept
issued: 2022-05-19T10:12:00
modified: 2024-06-05T11:38:19
alternative label: 18 kap. 10 § strafflagen
alternative label: Antigaylagstiftning
alternative label: Antihomosexuella lagar
alternative label: Kriminaliserat samkönat sex
alternative label: Sodomilagar
broader: Sexualbrottslagstiftning
in scheme: Queerlit
related: Sodomi
scope note: Används för skildringar av lagar mot samkönat sex. För lagstiftning som begränsar spridandet av information om hbtqi-frågor, använd ämnesordet "Censur".

Äldre intersexpersoner
type: Concept
issued: 2022-05-19T10:12:00
modified: 2024-03-19T10:00:33
alternative label: Gamla intersexpersoner
broader: Äldre hbtqi-personer
broader: Intersexpersoner
in scheme: Queerlit
scope note: Används för skildringar av äldre personer som beskrivs som intersex.

Queera ungdomar
type: Concept
issued: 2022-05-19T10:12:00
modified: 2022-06-07T15:09:28
alternative label: Queera tonåringar
alternative label: Unga queerpersoner
broader: Hbtqi-ungdomar
broader: Queera personer
in scheme: Queerlit
scope note: Används för skildringar av ungdomar som beskrivs som queera.

Närståendeadoption
type: Concept
issued: 2022-05-19T10:12:00
modified: 2022-05-19T10:12:00
broader: Adoption (hbtqi)
hidden label: Närstående-adoption
in scheme: Queerlit
related: Familjerätt (hbtqi)
scope note: Används för skildringar av adoption av ett barn som föräldern redan har en nära relation till. Det kan exempelvis vara att en ickebärande förälder adopterar sitt barn för att bli dess juridiska förälder.

Sapfister
type: Concept
issued: 2022-11-16T11:33:32
modified: 2022-11-16T11:33:32
alternative label: Sapfiska kvinnor
alternative label: Sapfist
alternative label: Sapphist
alternative label: Sapphister
broader: Historiska termer (hbtqi)
in scheme: Queerlit
related: Lesbiska
scope note: Används för skildringar, historiska eller historiserande, som använder begreppet sapfister - ett äldre ord som från det sena 1800-talet använts för att beskriva personer som antogs vara lesbiska.

Förföljelse av intersexpersoner
type: Concept
issued: 2022-05-19T10:12:00
modified: 2024-03-19T10:00:33
broader: Förföljelse av hbtqi-personer
in scheme: Queerlit
related: Intersexpersoner
scope note: Används för skildringar av förföljelse av intersexpersoner på grund av att de är intersexpersoner.

Unga bisexuella kvinnor
type: Concept
issued: 2022-09-13T11:22:43
modified: 2022-09-13T11:22:43
alternative label: Kvinnliga bisexuella tonåringar
alternative label: Kvinnliga bisexuella ungdomar
broader: Bisexuella kvinnor
broader: Unga bisexuella
in scheme: Queerlit
scope note: Används för skildringar av ungdomar som beskrivs som bisexuella kvinnor.

Bugrar
type: Concept
issued: 2023-02-28T11:48:11
modified: 2023-02-28T11:48:11
alternative label: Bouger
alternative label: Bougrar
alternative label: Bougre
alternative label: Bougres
alternative label: Buger
alternative label: Bugers
alternative label: Bugger
alternative label: Buggers
alternative label: Buggrar
broader: Historiska termer (hbtqi)
in scheme: Queerlit
related: Sodomiter
scope note: Används för skildringar, historiska eller historiserande, som använder begreppet bugrar - ett äldre ord som oftast syftar på män som har, eller antas ha, sex med män.

Prostituerade kvinnor
type: Concept
issued: 2022-05-19T10:12:00
modified: 2023-03-29T10:25:38
alternative label: Call girls
alternative label: Kvinnliga prostituerade
broader: Prostituerade
in scheme: Queerlit
narrower: Prostituerade lesbiska
scope note: Används för skildringar av kvinnor som säljer eller har sålt sexuella tjänster.

Mäns femininitet
type: Concept
issued: 2022-05-19T10:12:00
modified: 2022-12-19T10:09:02
alternative label: Feminina män
alternative label: Kvinnliga män
alternative label: Manlig femininitet
alternative label: Manlig kvinnlighet
alternative label: Maskulin femininitet
alternative label: Maskulin kvinnlighet
alternative label: Mäns kvinnlighet
broader: Femininitet
in scheme: Queerlit
related: Flickpojkar
scope note: Används för skildringar av personer som beskrivs som män och som använder attribut, beteenden och roller som i allmänhet förknippas med kvinnor.

Kvinnomusikfestivaler
type: Concept
issued: 2022-05-19T10:12:00
modified: 2023-03-29T10:53:01
broader: Hbtqi-evenemang
hidden label: Kvinno-musikfestivaler
hidden label: Kvinnomusik-festivaler
in scheme: Queerlit
related: Kvinnomusik
scope note: Används för skildringar av musikfestivaler för kvinnor, oftast med kvinnliga utövare och med koppling till kvinnorörelsen.

Bigender-personer
type: Concept
issued: 2022-05-19T10:12:00
modified: 2022-06-07T15:09:28
broader: Transpersoner
in scheme: Queerlit
related: Genderfluid-personer
scope note: Används för skildringar av personer som beskrivs som bigender. Bigender-personer har två kön, antingen samtidigt eller omväxlande.

Lotusar (hbtqi)
type: Concept
issued: 2022-05-19T10:12:00
modified: 2023-12-06T09:24:17
broader: Historiska termer (hbtqi)
in scheme: Queerlit
related: Lesbiska
scope note: Används för skildringar, historiska eller historiserande, som använder begreppet lotus för att referera till personer som antas vara lesbiska.

Partners till intersexpersoner
type: Concept
issued: 2022-05-19T10:12:00
modified: 2024-03-19T10:00:33
broader: Partners (hbtqi)
in scheme: Queerlit
related: Intersexpersoner
scope note: Används för skildringar av personer som är partners till intersexpersoner, oavsett partnerns egna identitet.

Förklaringsmodeller (hbtqi)
type: Concept
issued: 2022-05-19T10:12:00
modified: 2023-12-06T09:24:17
alternative label: Etiologi (hbtqi)
broader: Teorier (hbtqi)
in scheme: Queerlit
related: Medikalisering
scope note: Används för skildringar där förklaringsmodeller för sexuella och/eller könsöverskridande beteenden har en framträdande betydelse för verket.

Förföljelse av lesbiska
type: Concept
issued: 2022-05-19T10:12:00
modified: 2022-05-19T10:12:00
broader: Förföljelse av homosexuella
in scheme: Queerlit
related: Lesbiska
scope note: Används för skildringar av förföljelse av lesbiska på grund av deras sexuella läggning.

Okönade barn
type: Concept
issued: 2022-05-19T10:12:00
modified: 2022-05-19T10:12:00
broader: Barn
broader: Okönade personer
in scheme: Queerlit
scope note: Används för skildringar av barn vars könstillhörighet inte framgår, och där detta har betydelse för verket.

Kärlekstrianglar
type: Concept
issued: 2022-05-19T10:12:00
modified: 2023-03-29T10:53:01
alternative label: Ménage à trois
alternative label: Triangeldrama
alternative label: Triangelrelationer
broader: Sexuella relationer
hidden label: Kärleks-trianglar
in scheme: Queerlit
related: Kärlek (hbtqi)
scope note: Används för skildringar av kärleksrelationer som involverar tre personer. Används både för skildringar av relationer där två personer har eller vill ha mer eller mindre exklusiva kärleksrelationer till en tredje person, och för att beskriva ömsesidiga tresamma kärleksrelationer.

Suffragetter
type: Concept
issued: 2022-05-19T10:12:00
modified: 2022-05-19T10:12:00
alternative label: Kvinnorösträttskämpar
alternative label: Rösträttskvinnor
alternative label: Suffragister
broader: Feminister
in scheme: Queerlit
related: Första vågens feminism
scope note: Används för skildringar av den militanta delen av kvinnorösträttsrörelsen kring sekelskiftet 1900.

Sextning
type: Concept
issued: 2022-05-19T10:12:00
modified: 2022-09-12T08:21:55
alternative label: Sexting
broader: Sex
in scheme: Queerlit
related: Sexualitet
scope note: Används för skildringar där det skickas sexuellt explicita meddelanden eller fotografier, främst mellan mobiltelefoner.

Bisexuella par
type: Concept
issued: 2022-05-19T10:12:00
modified: 2022-06-07T15:09:28
broader: Hbtqi-par
broader: Bisexuella
in scheme: Queerlit
scope note: Används för skildringar av parrelationer mellan bisexuella.

Dykes on bikes
type: Concept
issued: 2022-05-19T10:12:00
modified: 2022-05-19T10:12:00
broader: Lesbisk kultur
in scheme: Queerlit
related: Motorcykelklubbar (hbtqi)
scope note: Används för skildringar av den lesbiska motorcykelklubben.

Schamanism (hbtqi)
type: Concept
issued: 2022-05-19T10:12:00
modified: 2023-12-06T09:24:17
alternative label: Noaidi (hbtqi)
alternative label: Noajdde (hbtqi)
alternative label: Nåejti (hbtqi)
alternative label: Nåjder (hbtqi)
alternative label: Schamaner (hbtqi)
alternative label: Shamaner (hbtqi)
alternative label: Shamanism (hbtqi)
broader: Religion (hbtqi)
in scheme: Queerlit
related: Faeries
scope note: Används för skildringar av hbtqi-personer som är schamaner. Används även för skildringar av hbtqi-personers förhållningssätt till schamanism eller andra schamaners förhållningssätt till hbtqi. Schamanism kan förstås som en animistisk världsåskådning.

Nakenbilder
type: Concept
issued: 2022-05-19T10:12:00
modified: 2024-09-05T13:44:36
alternative label: Nakenfotografier
alternative label: Nakenfoton
hidden label: Naken-bilder
hidden label: Naken-fotografier
hidden label: Naken-foton
in scheme: Queerlit
scope note: Används för skildringar där fotografier och andra bilder av nakna människokroppar har betydelse för verket.
top concept of: Queerlit

Sexualpolitiska organisationer
type: Concept
issued: 2022-05-19T10:12:00
modified: 2023-03-29T10:53:01
alternative label: Organisationer för sexualvetenskap och sexualreform
broader: Sexualitet
hidden label: Sexual-politiska organisationer
in scheme: Queerlit
related: Hbtqi-rörelser
scope note: Används för skildringar av organisationer som strävar efter sexuella reformer, kämpar för sexuella rättigheter och/eller förmedlar information om sex.

Hypersexualitet
type: Concept
issued: 2022-05-19T10:12:00
modified: 2024-03-19T12:38:35
alternative label: Don Juanism
alternative label: Furor amatorius
alternative label: Furor uterinus
alternative label: Nymfomani
alternative label: Satyriasis
alternative label: Översexualitet
broader: Sexmissbruk
hidden label: Hyper-sexualitet
in scheme: Queerlit
related: Sexualitet
scope note: Används för skildringar av okontrollerad och överdriven sexualdrift som inverkar negativt på personens liv och vardag.

Amerikanska ursprungsreligioner (hbtqi)
type: Concept
issued: 2022-05-19T10:12:00
modified: 2023-12-06T09:24:17
alternative label: First Nations-religioner (hbtqi)
broader: Religion (hbtqi)
in scheme: Queerlit
related: Ursprungsamerikaner (hbtqi)
scope note: Används för skildringar av hbtqi-personer som är anhängare av religioner med ursprung i det förkoloniala Amerika. Används även för skildringar av hbtqi-personers förhållningssätt till amerikanska ursprungsreligioner eller hur andra anhängare av dessa religioner förhåller sig till hbtqi.

Vampyrer (hbtqi)
type: Concept
issued: 2022-05-19T10:12:00
modified: 2023-12-06T09:24:17
broader: Historiska termer (hbtqi)
in scheme: Queerlit
related: Lesbiska
scope note: Används för skildringar, historiska eller historiserande, som använder begreppet vampyrer för att referera till personer som antas vara lesbiska, eller på annat sätt förkroppsliga samkönat eller gränsöverskridande begär. För skildringar av sexuella praktiker som involverar drickande av blod, använd ämnesordet "Vampyrism".

Vaginoplastik
type: Concept
issued: 2022-05-19T10:12:00
modified: 2023-01-11T08:39:46
broader: Underlivskirurgi (transpersoner)
in scheme: Queerlit
related: Neovaginor
scope note: Används för skildringar av könsbekräftande operationer med syfte att konstruera vulvor och vaginor.

Äldre bisexuella män
type: Concept
issued: 2022-05-19T10:12:00
modified: 2024-03-19T10:00:33
alternative label: Gamla bisexuella män
broader: Bisexuella män
broader: Äldre bisexuella
in scheme: Queerlit
scope note: Används för skildringar av äldre personer som beskrivs som bisexuella män.

Okönade äldre
type: Concept
issued: 2022-05-19T10:12:00
modified: 2022-05-19T10:12:00
broader: Äldre
broader: Okönade personer
in scheme: Queerlit
scope note: Används för skildringar av äldre vars könstillhörighet inte framgår, och där detta har betydelse för verket.

Läderkvinnor
type: Concept
issued: 2022-05-19T10:12:00
modified: 2022-05-19T10:12:00
broader: Lädergemenskaper
hidden label: Läder-flator
hidden label: Läder-kvinnor
hidden label: Läderflator
in scheme: Queerlit
narrower: Lädermammor
scope note: Används för skildringar av kvinnor som är en del av lädergemenskaper.

Idrottsföreningar (hbtqi)
type: Concept
issued: 2022-05-19T10:12:00
modified: 2024-03-19T10:08:14
alternative label: Idrottsklubbar (hbtqi)
alternative label: Idrottssällskap (hbtqi)
alternative label: Sportklubbar (hbtqi)
broader: Hbtqi-föreningar
hidden label: Idrotts-föreningar (hbtqi)
in scheme: Queerlit
related: Idrottare (hbtqi)
scope note: Används för skildringar av föreningar för hbtqi-personer som startats med syfte att utöva och ofta tävla i en eller flera idrotter.

Latines (hbtqi)
type: Concept
issued: 2022-05-19T10:12:00
modified: 2023-12-06T09:24:17
alternative label: Chican@s (hbtqi)
alternative label: Chicanas (hbtqi)
alternative label: Chicanos (hbtqi)
alternative label: Latin@ (hbtqi)
alternative label: Latin@s (hbtqi)
alternative label: Latinamerikaner (hbtqi)
alternative label: Latinas (hbtqi)
alternative label: Latinos (hbtqi)
alternative label: Latinx (hbtqi)
alternative label: Latinxs (hbtqi)
broader: Icke-vita hbtqi-personer
broader: Etniska grupper (hbtqi)
in scheme: Queerlit
scope note: Används för skildringar av hbtqi-personer med eget eller historiskt ursprung i Latinamerika.

Familjer med ensamstående föräldrar
type: Concept
issued: 2022-05-19T10:12:00
modified: 2022-05-19T10:12:00
core#: Familjer med ensamstående föräldrar (hbtqi)
alternative label: Enförälderfamiljer
broader: Hbtqi-familjer
in scheme: Queerlit
narrower: Familjer med ensamstående föräldrar (hbtqi)
scope note: Används för skildringar av familjer bestående av en vuxen person som lever ensam med barn och har ensam eller delad vårdnad där barnen bor hos föräldern på minst halvtid.

Replekar (BDSM)
type: Concept
issued: 2022-05-19T10:12:00
modified: 2022-05-19T10:12:00
alternative label: Shibari
broader: Sexhjälpmedel
broader: Bondage
in scheme: Queerlit
scope note: Används för skildringar av en form av bondage där rep används för att binda, begränsa rörelser, linda eller hålla fast en person i en sexuell kontext.

Hormoner
type: Concept
issued: 2022-05-19T10:12:00
modified: 2023-10-19T11:39:43
alternative label: Testosteron
alternative label: Östrogen
broader: Biologiskt kön
in scheme: Queerlit
related: Hormonbehandling (kön)
scope note: Används för skildringar där hormoner har betydelse för verket.

Tredje kön-personer
type: Concept
issued: 2022-05-19T10:12:00
modified: 2022-06-07T15:09:28
alternative label: 3:e kön-personer
broader: Transpersoner
in scheme: Queerlit
related: Tredje könet
scope note: Används för skildringar av personer som beskrivs som tredje kön-personer och inte som man eller kvinna.

Urningar
type: Concept
issued: 2022-05-19T10:12:00
modified: 2023-12-06T09:24:17
alternative label: Uranier
broader: Historiska termer (hbtqi)
in scheme: Queerlit
related: Uranism
scope note: Används för skildringar, historiska eller historiserande, som använder begreppet urningar - ett under det sena 1800-talet och tidiga 1900-talet använt ord, främst för homosexuella män, men inkluderande ett spektrum av hbtqi-identiteter och -praktiker.

Ensamstående mammor (hbtqi)
type: Concept
issued: 2022-05-19T10:12:00
modified: 2023-12-06T09:24:17
broader: Ensamstående föräldrar (hbtqi)
broader: Mammor
in scheme: Queerlit
scope note: Används för skildringar av mammor som är hbtqi-personer och som lever ensamma med barn och har ensam eller delad vårdnad där barnen bor hos mamman på minst halvtid.

Pappor till bögar
type: Concept
issued: 2022-05-19T10:12:00
modified: 2022-05-19T10:12:00
alternative label: Bögars fäder
alternative label: Bögars pappor
alternative label: Fäder till bögar
broader: Föräldrar till bögar
broader: Pappor till homosexuella
in scheme: Queerlit
scope note: Används för skildringar av pappor till bögar, oavsett pappans egen identitet.

Heterosexuella flickor
type: Concept
issued: 2022-05-19T10:12:00
modified: 2022-05-19T10:12:00
broader: Heterosexuella barn
broader: Flickor
in scheme: Queerlit
scope note: Används för skildringar av heterosexuella flickor. Ämnesordet används för skildringar där identiteten som heterosexuell är i fokus.

Hemlighetssymbolik (hbtqi)
type: Concept
issued: 2022-05-19T10:12:00
modified: 2023-12-06T09:24:17
broader: Symbolik (hbtqi)
hidden label: Hemlighets-symbolik (hbtqi)
in scheme: Queerlit
related: Diskretion (hbtqi)
scope note: Används för skildringar där hemligheter och hemlighållande används som symbolik för att signalera samkönade sexuella praktiker, känslor, identiteter och/eller överskridanden av binära könsnormer.

Kriminalisering
type: Concept
issued: 2022-05-19T10:12:00
modified: 2022-05-19T10:12:00
broader: Straffrätt
in scheme: Queerlit
related: Avkriminalisering
scope note: Används för skildringar av att genom ändrad lagstiftning göra något olagligt som tidigare varit lagligt.

Feminiserande crossdressing
type: Concept
issued: 2022-09-12T08:21:55
modified: 2022-09-12T08:21:55
broader: Crossdressing
in scheme: Queerlit
related: Transfeminina
scope note: Används för skildringar av crossdressing med feminint kodade kläder.

Äggdonatorer
type: Concept
issued: 2022-05-19T10:12:00
modified: 2024-06-05T11:38:19
broader: Donatorer (medicin)
hidden label: Ägg-donatorer
in scheme: Queerlit
related: Skaffa barn (hbtqi)
scope note: Används för skildringar av personer som donerar sina ägg till andra personer eller par.

Partners till lesbiska
type: Concept
issued: 2022-05-19T10:12:00
modified: 2023-03-29T10:25:38
broader: Partners till homosexuella
in scheme: Queerlit
related: Lesbiska
scope note: Används för skildringar av personer som är partners till lesbiska, oavsett partnerns egen identitet.

Pappor till ickebinära personer
type: Concept
issued: 2022-11-23T07:43:01
modified: 2022-11-23T07:43:01
alternative label: Fäder till ickebinära personer
alternative label: Ickebinäras fäder
alternative label: Ickebinäras pappor
broader: Föräldrar till ickebinära personer
broader: Pappor till transpersoner
in scheme: Queerlit
scope note: Används för skildringar av pappor till ickebinära personer, oavsett pappans egen identitet.

Pappor till transkvinnor
type: Concept
issued: 2023-12-13T10:57:15
modified: 2023-12-13T10:57:15
alternative label: Fäder till transflickor
alternative label: Fäder till transkvinnor
alternative label: Transflickors fäder
alternative label: Transflickors pappor
alternative label: Transkvinnors fäder
alternative label: Transkvinnors pappor
broader: Föräldrar till transkvinnor
broader: Pappor till transpersoner
in scheme: Queerlit
scope note: Används för skildringar av pappor till transkvinnor, oavsett pappans egen identitet.

Vaginala samlag
type: Concept
issued: 2022-05-19T10:12:00
modified: 2022-05-19T10:12:00
broader: Samlag
broader: Vaginalsex
in scheme: Queerlit
scope note: Används för skildringar av penetrerande vaginalsex.

Queera par
type: Concept
issued: 2022-05-19T10:12:00
modified: 2022-06-07T15:09:28
broader: Hbtqi-par
broader: Queera personer
in scheme: Queerlit
scope note: Används för skildringar av parrelationer mellan queera personer.

Demigenderpersoner
type: Concept
issued: 2022-05-19T10:12:00
modified: 2022-06-22T14:37:20
broader: Transpersoner
hidden label: Demigender-personer
in scheme: Queerlit
related: Könsidentitet
scope note: Används för skildringar av personer som beskrivs som demigender, det vill säga som halvt identifierande sig med ett kön och halvt med ett annat, eller som halvt ett kön och halvt inget kön.

Katoey
type: Concept
issued: 2022-11-23T07:52:04
modified: 2022-11-23T07:52:04
alternative label: Kathoey
alternative label: Kathoy
alternative label: Katoy
alternative label: Ladyboy
alternative label: Ladyboys
broader: Könsöverskridanden
broader: Könsidentitet
in scheme: Queerlit
scope note: Används för skildringar av personer som beskrivs som katoey. Begreppet används framförallt i Thailand för att beskriva transpersoner (eller i vissa fall bögar) med feminina könsuttryck, som ibland betraktas som ett tredje kön.

Okönade föräldrar
type: Concept
issued: 2022-05-19T10:12:00
modified: 2022-05-19T10:12:00
broader: Föräldrar (hbtqi)
broader: Okönade personer
in scheme: Queerlit
scope note: Används för skildringar av föräldrar vars könstillhörighet inte framgår, och där detta har betydelse för verket.

Mammor till transkvinnor
type: Concept
issued: 2023-12-13T10:57:15
modified: 2023-12-13T10:57:15
alternative label: Mödrar till transflickor
alternative label: Mödrar till transkvinnor
alternative label: Transflickors mammor
alternative label: Transflickors mödrar
alternative label: Transkvinnors mammor
alternative label: Transkvinnors mödrar
broader: Mammor till transpersoner
broader: Föräldrar till transkvinnor
in scheme: Queerlit
scope note: Används för skildringar av mammor till transkvinnor, oavsett mammans egen identitet.

Ögonbindlar
type: Concept
issued: 2022-05-19T10:12:00
modified: 2024-06-05T11:38:19
broader: Sexhjälpmedel
in scheme: Queerlit
related: BDSM
scope note: Används för skildringar av plagg för att förhindra att bäraren ser i sexuella sammanhang.

Tantrasex
type: Concept
issued: 2022-05-19T10:12:00
modified: 2022-05-19T10:12:00
alternative label: Neotantra
alternative label: Tantriskt sex
broader: Sexuella praktiker
broader: Sex
in scheme: Queerlit
scope note: Används för skildringar av den sexuella praktiken tantrasex som har sin grund i den hinduistiska och buddhistiska tantrafilosofin.

Porrindustri
type: Concept
issued: 2022-05-19T10:12:00
modified: 2022-05-19T10:12:00
broader: Sexindustri
hidden label: Porr-industri
in scheme: Queerlit
related: Porrfilmer (hbtqi)
scope note: Används för skildringar av produktion och distribution av porr.

Ageplay
type: Concept
issued: 2022-05-19T10:12:00
modified: 2022-05-19T10:12:00
alternative label: Age play
broader: Rollspel (sexualitet)
in scheme: Queerlit
related: BDSM
scope note: Används för skildringar av rollspel mellan vuxna, baserat på samtycke, där en eller flera person betraktas eller behandlas som en annan ålder än den faktiska. Ageplay kan, men måste inte, vara sexuellt.

Vibratorer
type: Concept
issued: 2022-05-19T10:12:00
modified: 2022-05-19T10:12:00
broader: Sexhjälpmedel
in scheme: Queerlit
related: Dildoar
scope note: Används för skildringar av vibrerande sexhjälpmedel.

Mammor till ickebinära personer
type: Concept
issued: 2022-11-23T07:43:01
modified: 2022-11-23T07:43:01
alternative label: Ickebinäras mammor
alternative label: Ickebinäras mödrar
alternative label: Mödrar till ickebinära personer
broader: Mammor till transpersoner
broader: Föräldrar till ickebinära personer
in scheme: Queerlit
scope note: Används för skildringar av mammor till ickebinära personer, oavsett mammans egen identitet.

Telefonsexarbetare
type: Concept
issued: 2022-05-19T10:12:00
modified: 2023-03-29T10:53:01
alternative label: Telefonsexsäljare
broader: Sexarbetare (hbtqi)
hidden label: Telefon-sexarbetare
in scheme: Queerlit
related: Telefonsex
scope note: Används för skildringar av personer som arbetar med att föra sexuellt explicita samtal över telefon.

Första vågens feminism
type: Concept
issued: 2022-05-19T10:12:00
modified: 2022-05-19T10:12:00
alternative label: Första vågens kvinnorörelser
broader: Feminism
in scheme: Queerlit
related: Suffragetter
scope note: Används för skildringar av de feministiska strömningar som etablerades runt sekelskiftet 1900, med fokus på juridisk jämställdhet och rösträttsfrågor.

Nipple play
type: Concept
issued: 2022-05-19T10:12:00
modified: 2022-05-19T10:12:00
alternative label: Bröstvårtssex
broader: Sexuella praktiker
broader: Sex
in scheme: Queerlit
scope note: Används för skildringar av stimulering och beröring av bröstvårtor i en sexuell kontext.

Vuxenadoption
type: Concept
issued: 2022-05-19T10:12:00
modified: 2022-05-19T10:12:00
broader: Adoption (hbtqi)
hidden label: Vuxen-adoption
in scheme: Queerlit
related: Familjerätt (hbtqi)
scope note: Används för skildringar av adoption av en myndig person. Det kan exempelvis handla om ett samkönat par där en äldre partner adopterar en yngre för att säkra juridiska rättigheter som annars inte är tillgängliga.

Skinkor
type: Concept
issued: 2022-05-19T10:12:00
modified: 2022-05-19T10:12:00
broader: Erogena zoner
in scheme: Queerlit
related: Smiskning
scope note: Används för skildringar där de större muskler och vävnader som är delar av rumpan har en framträdande betydelse för verket.

Medmammor (hbtqi)
type: Concept
issued: 2022-05-19T10:12:00
modified: 2023-12-06T09:24:17
broader: Medföräldrar (hbtqi)
broader: Mammor
hidden label: Med-mammor (hbtqi)
in scheme: Queerlit
scope note: Används för skildringar av hbtqi-familjer som innefattar medmammor - mammor som de andra föräldrarna inte har, eller haft, en romantisk relation med

Penisringar
type: Concept
issued: 2022-05-19T10:12:00
modified: 2022-05-19T10:12:00
alternative label: Kukringar
broader: Sexhjälpmedel
in scheme: Queerlit
related: Penisar
scope note: Används för skildringar av ringar som sätts runt penis och förstärker erektionen samt möjliggör ytterligare stimulering.

Porrbiografer
type: Concept
issued: 2022-05-19T10:12:00
modified: 2024-06-05T11:38:19
alternative label: Sexbiografer
broader: Sexindustri
in scheme: Queerlit
related: Porrfilmer (hbtqi)
scope note: Används för skildringar av inrättningar där porrfilm visas i biosalong eller bås.

Slicklappar
type: Concept
issued: 2022-05-19T10:12:00
modified: 2022-05-19T10:12:00
alternative label: Kofferdam
broader: Sexhjälpmedel
in scheme: Queerlit
related: Säkrare sex
scope note: Används för skildringar av tunna dukar av latex eller gummi som läggs över vulvan, slidan eller analen vid oralsex.

Pappor till lesbiska
type: Concept
issued: 2022-05-19T10:12:00
modified: 2022-05-19T10:12:00
alternative label: Fäder till lesbiska
alternative label: Lesbiskas fäder
alternative label: Lesbiskas pappor
broader: Pappor till homosexuella
broader: Föräldrar till lesbiska
in scheme: Queerlit
scope note: Används för skildringar av pappor till lesbiska, oavsett pappans egen identitet.

Förälskelse (hbtqi)
type: Concept
issued: 2022-05-19T10:12:00
modified: 2023-12-06T09:24:17
broader: Kärlek (hbtqi)
in scheme: Queerlit
related: Relationer (hbtqi)
scope note: Används för skildringar där hbtqi-personer upplever spirande kärlek och mer eller mindre hastigt uppkomna känslor av lycka, närhetslängtan och energi kopplad till en eller flera andra personer.

Surrogatskap
type: Concept
issued: 2022-05-19T10:12:00
modified: 2022-05-19T10:12:00
alternative label: Surrogatmödraskap
alternative label: Värdmödraskap
broader: Skaffa barn (hbtqi)
in scheme: Queerlit
related: Donatorer (medicin)
scope note: Används för skildringar av personer som för andras räkning, med eller utan ekonomisk ersättning, genomgår en graviditet och en förlossning. Efter förlossning övergår föräldraskapet till den/dem surrogatföräldern burit barnet åt. Surrogatföräldern behöver inte vara genetisk förälder men kan vara det.

Partialism
type: Concept
issued: 2022-05-19T10:12:00
modified: 2022-05-19T10:12:00
alternative label: Kroppsdelsfetischism
broader: Fetischism (sexualitet)
in scheme: Queerlit
related: Erogena zoner
scope note: Används för skildringar av fetischer rörande specifika delar av människokroppen.

Metamourer
type: Concept
issued: 2022-05-19T10:12:00
modified: 2022-05-19T10:12:00
broader: Polyamori
broader: Partners (hbtqi)
in scheme: Queerlit
scope note: Används för skildringar av partners till ens partner i flersamma eller öppna relationer, med vilken en inte har ett direkt sexuellt förhållande.

Könsväxlingar
type: Concept
issued: 2022-05-19T10:12:00
modified: 2023-12-06T09:24:17
alternative label: Köns-förvandlingar
alternative label: Köns-växlingar
alternative label: Könsförvandlingar
broader: Könsöverskridanden
in scheme: Queerlit
related: Förvandlingssymbolik (hbtqi)
scope note: Används för skildringar där personer, en eller flera gånger, kroppsligt växlar kön. Förändringen bör i någon mån vara magisk eller oförklarlig. För skildringar där förvandlingen främst fyller en symbolisk funktion, använd ämnesordet "Förvandlingssymbolik (hbtqi)".

Hermafroditer
type: Concept
issued: 2022-05-19T10:12:00
modified: 2023-05-31T12:15:52
broader: Historiska termer (hbtqi)
in scheme: Queerlit
related: Intersexpersoner
scope note: Används för skildringar, historiska eller historiserande, som använder begreppet hermafroditer - ett äldre ord som bland annat använts för att beskriva intersexvariationer, transidentiteter och -uttryck samt samkönad sexuell praktik.

Gay for pay
type: Concept
issued: 2022-05-19T10:12:00
modified: 2022-05-19T10:12:00
broader: Prostituerade
in scheme: Queerlit
related: Porrskådespelare
scope note: Används för skildringar av heterosexuella personer som genom främst pornografi och prostitution betalas för att ha samkönat sex.

Mor- och farföräldrar
type: Concept
issued: 2022-05-19T10:12:00
modified: 2022-06-22T14:37:20
alternative label: Farfar
alternative label: Farfäder
alternative label: Farföräldrar
alternative label: Farmor
alternative label: Farmödrar
alternative label: Föräldraförälder
alternative label: Föräldraföräldrar
alternative label: Morfar
alternative label: Morfäder
alternative label: Morföräldrar
alternative label: Mormor
alternative label: Mormödrar
broader: Föräldrar (hbtqi)
in scheme: Queerlit
related: Barnbarn
scope note: Används för skildringar av personer som är föräldrar till föräldrar, oavsett de inblandade generationernas könsidentitet eller biologiska släktskap.

Heterosocialitet
type: Concept
issued: 2022-05-19T10:12:00
modified: 2022-05-19T10:12:00
broader: Relationer (hbtqi)
hidden label: Hetero-socialitet
in scheme: Queerlit
related: Homosocialitet
scope note: Används för skildringar av hur personer som inte liknar varandra skapar och upprätthåller relationer till varandra. Vanligtvis åsyftas män och kvinnor som umgås med varandra utan att ha sexuella relationer.

Personer som lever med välbehandlad hiv
type: Concept
issued: 2022-05-19T10:12:00
modified: 2022-05-19T10:12:00
alternative label: Personer som lever med smittfri hiv
broader: Personer som lever med hiv
in scheme: Queerlit
related: Hiv/aids
scope note: Används för skildringar av personer som lever med så välbehandlad hiv att virusnivåerna är omätbära och därmed oöverförbara.

Pappor till queera personer
type: Concept
issued: 2022-05-19T10:12:00
modified: 2022-06-07T15:09:28
alternative label: Fäder till queera personer
alternative label: Queera personers fäder
alternative label: Queera personers pappor
broader: Pappor till hbtqi-personer
broader: Föräldrar till queera personer
in scheme: Queerlit
scope note: Används för skildringar av pappor till queera personer, oavsett pappans egen identitet.

Lesbisk separatism
type: Concept
issued: 2022-05-19T10:12:00
modified: 2022-05-19T10:12:00
broader: Homosexuell separatism
in scheme: Queerlit
related: Lesbisk feminism
scope note: Används för skildringar av frivillig ideologisk, social, kulturell och ibland fysisk separation av lesbiska från män och heterosexuella kvinnor.

Kvinnomusik
type: Concept
issued: 2022-05-19T10:12:00
modified: 2022-05-19T10:12:00
alternative label: Kvinnoidentifierad musik
alternative label: Lesbisk musik
alternative label: Qvinnomusik
broader: Lesbisk kultur
in scheme: Queerlit
related: Kvinnomusikfestivaler
scope note: Används för skildringar av den musik skapad av och för kvinnor som med start under 1970-talet blev en del av kvinnorörelsens uttryck.

Bögpar
type: Concept
issued: 2022-05-19T10:12:00
modified: 2022-06-07T15:09:28
broader: Bögar
broader: Homosexuella par
hidden label: Bög-par
in scheme: Queerlit
scope note: Används för skildringar av parrelationer mellan bögar.

Hemlösa hbtqi-personer
type: Concept
issued: 2022-05-19T10:12:00
modified: 2023-12-06T09:24:17
alternative label: Bostadslösa hbtqi-personer
alternative label: Uteliggare (hbtqi)
broader: Hbtqi-personer
in scheme: Queerlit
narrower: Hemlösa hbtqi-ungdomar
scope note: Används för skildringar av hbtqi-personer som lever i hemlöshet. Hemlöshet innebär att personen saknar en fast bostad i en kultur där fast bostad är norm.

Intersexpar
type: Concept
issued: 2022-05-19T10:12:00
modified: 2024-03-19T10:00:33
broader: Hbtqi-par
broader: Intersexpersoner
hidden label: Intersex-par
in scheme: Queerlit
scope note: Används för skildringar av parrelationer mellan intersexpersoner.

Förföljelse av bögar
type: Concept
issued: 2022-05-19T10:12:00
modified: 2022-05-19T10:12:00
broader: Förföljelse av homosexuella
in scheme: Queerlit
related: Bögar
scope note: Används för skildringar av förföljelse av bögar på grund av deras sexuella läggning.

Förföljelse av queera personer
type: Concept
issued: 2022-05-19T10:12:00
modified: 2022-05-19T10:12:00
broader: Förföljelse av hbtqi-personer
in scheme: Queerlit
related: Queera personer
scope note: Används för skildringar av förföljelse av queera personer på grund av deras sexualitet, könsidentitet och/eller könsuttryck.

Nypning (sexualitet)
type: Concept
issued: 2022-05-19T10:12:00
modified: 2022-05-19T10:12:00
broader: Sex med händerna
broader: Sexuella praktiker
in scheme: Queerlit
scope note: Används för skildringar av att nypas i en sexuell kontext för erotisk stimulans och/eller upphetsning.

Äldre transkvinnor
type: Concept
issued: 2022-09-13T11:22:43
modified: 2022-09-13T11:22:43
alternative label: Gamla transkvinnor
broader: Äldre transpersoner
broader: Transkvinnor
in scheme: Queerlit
scope note: Används för skildringar av äldre personer som beskrivs som transkvinnor.

Orkidektomi
type: Concept
issued: 2022-05-19T10:12:00
modified: 2022-05-19T10:12:00
alternative label: Orkiektomi
broader: Underlivskirurgi (transpersoner)
broader: Kastrering
in scheme: Queerlit
scope note: Används för skildringar av kirugiskt avlägsnande av ena eller båda testiklarna.

Queera prostituerade
type: Concept
issued: 2022-05-19T10:12:00
modified: 2022-06-07T15:09:28
broader: Prostituerade
broader: Queera personer
in scheme: Queerlit
scope note: Används för skildringar av queera personer som säljer eller har sålt sexuella tjänster.

Unga intersexpersoner
type: Concept
issued: 2022-05-19T10:12:00
modified: 2022-06-07T15:09:28
alternative label: Intersextonåringar
alternative label: Intersexungdomar
broader: Intersexpersoner
broader: Hbtqi-ungdomar
in scheme: Queerlit
scope note: Används för skildringar av ungdomar som beskrivs som intersex.

Latexhandskar
type: Concept
issued: 2022-05-19T10:12:00
modified: 2022-05-19T10:12:00
broader: Sexhjälpmedel
in scheme: Queerlit
related: Säkrare sex
scope note: Används för skildringar där handskar i latex som används för säkrare sex har betydelse för verket.

Unga bögar
type: Concept
issued: 2022-05-19T10:12:00
modified: 2022-06-07T15:09:28
alternative label: Tonårsbögar
broader: Bögar
broader: Unga homosexuella
in scheme: Queerlit
scope note: Används för skildringar av ungdomar som beskrivs som bögar.

Svarta hbtqi-personer
type: Concept
issued: 2022-05-19T10:12:00
modified: 2023-12-06T09:24:17
alternative label: Afro-oceanier (hbtqi)
alternative label: Afroamerikaner (hbtqi)
alternative label: Afroasiater (hbtqi)
alternative label: Afroeuropéer (hbtqi)
alternative label: Afrosvenskar (hbtqi)
broader: Icke-vita hbtqi-personer
broader: Etniska grupper (hbtqi)
in scheme: Queerlit
scope note: Används för skildringar av homosexuella, bisexuella, transpersoner, queera och/eller intersexpersoner som beskrivs som svarta. Svart förstås här som en rasifierande kategori som markerar personer med melaninrik hud, ofta med eget eller historiskt ursprung i subsahariska Afrika eller Oceanien. Ämnesordet används för skildringar där identiteten som svart är i fokus.

Penektomi
type: Concept
issued: 2022-05-19T10:12:00
modified: 2022-05-19T10:12:00
broader: Könsstympning av intersexpersoner
broader: Underlivskirurgi (transpersoner)
in scheme: Queerlit
related: Kastrering
scope note: Används för skildringar av operationer för att avlägsna hela eller delar av penis.

Intersexfamiljer
type: Concept
issued: 2022-05-19T10:12:00
modified: 2022-05-19T10:12:00
broader: Hbtqi-familjer
hidden label: Intersex-familjer
in scheme: Queerlit
related: Intersexföräldrar
related: Barn till intersexpersoner
scope note: Används för skildringar av familjer bestående av vuxna intersexpersoner som lever med barn.

Partners till transpersoner
type: Concept
issued: 2022-05-19T10:12:00
modified: 2023-03-29T10:25:38
broader: Partners (hbtqi)
in scheme: Queerlit
narrower: Partners till transvestiter
related: Transpersoner
scope note: Används för skildringar av personer som är partners till transpersoner, oavsett partnerns egen identitet.

Psykisk ohälsa
type: Concept
issued: 2022-05-19T10:12:00
modified: 2023-03-29T10:25:38
alternative label: Mentala störningar
alternative label: Mentalsjukdomar
alternative label: Psykisk hälsa
alternative label: Psykiska sjukdomar
alternative label: Psykiska störningar
in scheme: Queerlit
narrower: Missnöje med egen sexuell läggning
scope note: Används för skildringar av psykisk ohälsa, ett samlingsbegrepp som inkluderar både psykiatriska tillstånd (diagnostiserad psykisk ohälsa) och psykiska besvär som nedstämdhet och oro.
top concept of: Queerlit

Misogyni
type: Concept
issued: 2022-05-19T10:12:00
modified: 2022-05-19T10:12:00
alternative label: Kvinnohat
in scheme: Queerlit
related: Intolerans mot hbtqi-personer
scope note: Används för skildringar där hatiska eller föraktfulla attityder gentemot kvinnor och/eller flickor har betydelse för verket.
top concept of: Queerlit

Urinsex
type: Concept
issued: 2022-05-19T10:12:00
modified: 2022-05-19T10:12:00
alternative label: Golden showers
alternative label: Undinism
alternative label: Urolagni
alternative label: Water sports
alternative label: Wet (sex)
broader: Sexuella praktiker
broader: Sex
in scheme: Queerlit
related: Fetischism (sexualitet)
scope note: Används för skildringar av sex som avsiktligt involverar urin.

Medföräldrar (hbtqi)
type: Concept
issued: 2022-05-19T10:12:00
modified: 2023-12-06T09:24:17
broader: Föräldrar (hbtqi)
hidden label: Med-föräldrar (hbtqi)
in scheme: Queerlit
narrower: Medpappor (hbtqi)
narrower: Medmammor (hbtqi)
scope note: Används för skildringar av hbtqi-familjer som innefattar medföräldrar - föräldrar som de andra föräldrarna inte har, eller haft, en romantisk relation med.

Queera familjer
type: Concept
issued: 2022-05-19T10:12:00
modified: 2022-05-19T10:12:00
broader: Hbtqi-familjer
in scheme: Queerlit
related: Barn till queera personer
related: Queera personer
scope note: Används för skildringar av familjer bestående av queera vuxna som lever med barn.

Underkläder
type: Concept
issued: 2022-05-19T10:12:00
modified: 2022-05-19T10:12:00
broader: Kläder
broader: Sexhjälpmedel
in scheme: Queerlit
related: Crossdressing
scope note: Används för skildringar av kläder främst avsedda att användas under andra kläder, oftast närmast kroppen.

Inverterade
type: Concept
issued: 2022-05-19T10:12:00
modified: 2023-12-06T09:24:17
alternative label: Sexualinverterade
alternative label: Sexuellt inverterade
broader: Historiska termer (hbtqi)
in scheme: Queerlit
related: Uranism
related: Sexuell inversion
scope note: Används för skildringar, historiska eller historiserande, som använder begreppet inverterade - ett äldre ord som syftar på en föreställd omkastning av förväntade könsrelaterade egenskaper, begär eller kroppsliga karakteristika hos en person. Historiskt har begreppet främst använts för att beskriva personer med samkönad begärsriktning, men förekommer även som beskrivning på andra inom hbtqi-spektrat.

Poppers
type: Concept
issued: 2022-05-19T10:12:00
modified: 2023-06-14T12:30:11
alternative label: Alkylnitrit
alternative label: Amylnitrit
alternative label: Butylnitrit
alternative label: Isobutylnitrit
broader: Sexhjälpmedel
in scheme: Queerlit
related: Droganvändning (hbtqi)
related: Kemsex
scope note: Används för skildringar av nitriter som inhaleras för ökad sexuell njutning. Drogen blev populär inom klubb- och gayscenen under 1970-talet.

Transrörelser
type: Concept
issued: 2022-05-19T10:12:00
modified: 2022-05-19T10:12:00
broader: Könsöverskridanden
broader: Hbtqi-rörelser
hidden label: Trans-rörelser
in scheme: Queerlit
related: Trans march
scope note: Används för skildringar av sociala rörelser som fokuserar på transpersoners rättigheter och levnadsvillkor.

Gossekärlek
type: Concept
issued: 2023-03-29T10:25:38
modified: 2023-03-29T10:25:38
broader: Historiska termer (hbtqi)
in scheme: Queerlit
related: Efebofili
related: Pederasti
scope note: Används för skildringar, historiska eller historiserande, som använder begreppet gossekärlek - ett äldre ord som oftast syftar på vuxna mäns erotiska och/eller romantiska dragning till och tonårspojkar. Historiskt har begreppet även använts som synonym för både manlig homosexualitet och pedofili.

Civil olydnad (hbtqi)
type: Concept
issued: 2022-05-19T10:12:00
modified: 2023-12-06T09:24:17
broader: Hbtqi-aktivism
in scheme: Queerlit
related: Arresteringar av hbtqi-personer
related: Ockupationen av Socialstyrelsen 1979
scope note: Används för skildringar av civil olydnad - att öppet och utan våld bryta mot en lag eller ett myndighetsbeslut - där kopplingen till hbtqi har en framträdande betydelse.

Barn till bögar
type: Concept
issued: 2022-05-19T10:12:00
modified: 2022-05-19T10:12:00
broader: Barn till homosexuella
in scheme: Queerlit
related: Bögföräldrar
related: Bögfamiljer
scope note: Används för skildringar av barn till personer som beskrivs som bögar.

Transfeminina
type: Concept
issued: 2022-05-19T10:12:00
modified: 2022-09-12T08:21:55
broader: Transpersoner
hidden label: Trans-feminina
in scheme: Queerlit
related: Femininitet
related: Feminiserande crossdressing
scope note: Används för skildringar av transpersoner med ett feminint könsuttryck som beskrivs som transfeminina.

Interkulturella relationer
type: Concept
issued: 2022-05-19T10:12:00
modified: 2022-05-19T10:12:00
alternative label: Förhållanden över kulturgränser
alternative label: Interkulturella förhållanden
alternative label: Relationer över kulturgränser
alternative label: Tvärkulturella förhållanden
alternative label: Tvärkulturella relationer
broader: Relationer (hbtqi)
in scheme: Queerlit
related: Relationspreferens
related: Sexuell identitet
scope note: Används för skildringar av sexuella relationer och kärleksrelationer mellan personer med olika kulturellt och/eller etniskt ursprung.

Lesbiska körer
type: Concept
issued: 2022-05-19T10:12:00
modified: 2022-05-19T10:12:00
broader: Lesbisk kultur
broader: Körer (hbtqi)
in scheme: Queerlit
related: Bögkörer
scope note: Används för skildringar av körer bestående av främst lesbiska.

Ateism (hbtqi)
type: Concept
issued: 2022-05-19T10:12:00
modified: 2023-12-06T09:24:17
alternative label: Ateister (hbtqi)
in scheme: Queerlit
related: Religion (hbtqi)
scope note: Används för skildringar av hbtqi-personer som är ateister. Används även för skildringar av hbtqi-personers förhållningssätt till ateism eller andra ateisters förhållningssätt till hbtqi.
top concept of: Queerlit

Relationer mellan lesbiska och bögar
type: Concept
issued: 2022-05-19T10:12:00
modified: 2022-05-19T10:12:00
alternative label: Relationer mellan bögar och lesbiska
broader: Könsförhållanden
in scheme: Queerlit
related: Bögar
related: Lesbiska
scope note: Används för skildringar av sociala och politiska förhållningssätt och relationer mellan lesbiska och bögar, individuellt och kollektivt.

Flickpojkar
type: Concept
issued: 2022-05-19T10:12:00
modified: 2023-03-29T10:53:01
alternative label: Tjejpojkar
broader: Pojkar
broader: Könsroller
hidden label: Flick-pojkar
in scheme: Queerlit
related: Mäns femininitet
scope note: Används för skildringar av pojkar som uppfattas som feminina eller vars beteende och uttryck inte överensstämmer med traditionella maskulina roller. Kan uppfattas som eller användas nedsättande.

Gifta hbtqi-par
type: Concept
issued: 2022-05-19T10:12:00
modified: 2023-12-06T09:24:17
broader: Hbtqi-par
broader: Civilstånd
in scheme: Queerlit
related: Äktenskap
scope note: Används för skildringar av hbtqi-par som lever i äktenskap med varandra. För skildringar av äktenskap där de ingående parterna har olika sexuella läggningar, använd ämnesordet "Blandäktenskap (sexuell läggning)".

Prostituerade bögar
type: Concept
issued: 2022-05-19T10:12:00
modified: 2023-03-29T10:25:38
broader: Bögar
broader: Prostituerade män
broader: Prostituerade homosexuella
in scheme: Queerlit
scope note: Används för skildringar av bögar som säljer eller har sålt sexuella tjänster.

Två pappor
type: Concept
issued: 2022-05-19T10:12:00
modified: 2022-05-19T10:12:00
alternative label: Två farsor
alternative label: Två fäder
broader: Pappor
in scheme: Queerlit
related: Bögföräldrar
related: Bisexuella föräldrar
scope note: Används för skildringar av två pappor med gemensamma barn, oavsett pappornas läggning eller sexuella identitet. För bisexuella respektive homosexuella pappor, använd även ämnesordet "Bisexuella föräldrar" eller "Bögföräldrar".

Ursprungsamerikaner (hbtqi)
type: Concept
issued: 2022-05-19T10:12:00
modified: 2023-12-06T09:24:17
alternative label: Amerikansk ursprungsbefolkning (hbtqi)
alternative label: First nations (hbtqi)
alternative label: Indianer (hbtqi)
alternative label: Urfolksamerikaner (hbtqi)
broader: Ursprungsbefolkningar (hbtqi)
in scheme: Queerlit
related: Amerikanska ursprungsreligioner (hbtqi)
related: Two-spirit
scope note: Används för skildringar av hbtqi-personer med historiskt ursprung i det förkoloniala Amerika.

Tuckning
type: Concept
issued: 2022-05-19T10:12:00
modified: 2022-05-19T10:12:00
alternative label: Tuckande
alternative label: Tucking
broader: Könsuttryck
broader: Könsöverskridanden
in scheme: Queerlit
related: Penisar
scope note: Används för skildringar av olika metoder för att dölja penis och pung.

Föräldrarätt
type: Concept
issued: 2022-05-19T10:12:00
modified: 2022-05-19T10:12:00
broader: Rättsstatus
in scheme: Queerlit
related: Föräldrar (hbtqi)
related: Familjerätt (hbtqi)
scope note: Används för skildringar där den del av familjerätten som reglerar vårdnad, underhåll, umgänge och adoptioner har betydelse för verket.

Syskon
type: Concept
issued: 2022-05-19T10:12:00
modified: 2023-04-05T12:12:25
broader: Familjemedlemmar
in scheme: Queerlit
narrower: Syskon (hbtqi)
related: Hbtqi-familjer
scope note: Används för skildringar av relationer mellan och till syskon.

Kabuki
type: Concept
issued: 2022-05-19T10:12:00
modified: 2022-05-19T10:12:00
broader: Könsöverskridanden
broader: Teater (hbtqi)
in scheme: Queerlit
related: Crossdressing
scope note: Används för skildringar av den japansk teaterformen kabuki, där skådespelare utövar crossdressing. Under det tidiga 1600-talet spelade kvinnliga artister både manliga och kvinnliga roller, men senare förbjöds kvinnor varpå manliga artister kom att spela både manliga och kvinnliga roller.

Ciskvinnor
type: Concept
issued: 2022-05-19T10:12:00
modified: 2023-03-29T10:25:38
broader: Kvinnor
broader: Cispersoner
hidden label: Cis-kvinnor
in scheme: Queerlit
related: AFAB
scope note: Används för skildringar av kvinnor som är cispersoner och där identiteten som ciskvinna är i fokus.

Barn utsatta för sexuella övergrepp (hbtqi)
type: Concept
issued: 2022-05-19T10:12:00
modified: 2023-12-06T09:24:17
broader: Offer för sexuella övergrepp (hbtqi)
broader: Hbtqi-barn
in scheme: Queerlit
related: Våldtäktsoffer (hbtqi)
scope note: Används för skildringar av hbtqi-barn som utsatts för sexuella övergrepp.

G-punkten
type: Concept
issued: 2022-05-19T10:12:00
modified: 2022-05-19T10:12:00
alternative label: CUV-komplexet
alternative label: Gräfenberg-punkten
broader: Klitoris
broader: Vaginor
in scheme: Queerlit
related: Orgasm
scope note: Används för skildringar av den erogena zonen mellan urinröret och den övre delen av slidans främre vägg.

Oskuld
type: Concept
issued: 2022-05-19T10:12:00
modified: 2022-05-19T10:12:00
alternative label: Mödom
alternative label: Svendom
broader: Sexuell avhållsamhet
in scheme: Queerlit
related: Asexualitet
related: Sexuell preferens
scope note: Används för skildringar där det att någon inte har haft sex har betydelse för verket.

Runka
type: Concept
issued: 2022-05-19T10:12:00
modified: 2022-05-19T10:12:00
broader: Onani
broader: Sex med händerna
broader: Penissex
in scheme: Queerlit
scope note: Används för skildringar av sexuell stimulering med händerna av penis. Vanligtvis åsyftas onani men runkandet kan även utföras på eller av andra personer.

Frieri (hbtqi)
type: Concept
issued: 2023-12-06T09:24:17
modified: 2023-12-06T09:24:17
broader: Samlevnadsformer
in scheme: Queerlit
related: Registrerade partnerskap
related: Äktenskap
scope note: Används för skildringar av personer som föreslår äktenskap eller partnerskap till någon annan. Ämnesordet används där kopplingen till hbtqi har en framträdande betydelse.

Chubs (identitet)
type: Concept
issued: 2022-05-19T10:12:00
modified: 2022-05-19T10:12:00
broader: Bögkultur
broader: Sexuell identitet
in scheme: Queerlit
related: Björnar (identitet)
scope note: Används för skildringar av personer som beskrivs som tillhörande chubssubkulturen. Subkulturen kännetecknas av tjocka bögar.

Testiklar
type: Concept
issued: 2022-05-19T10:12:00
modified: 2022-05-19T10:12:00
alternative label: Pungkulor
broader: Könsorgan
broader: Erogena zoner
broader: Könskörtlar
in scheme: Queerlit
scope note: Används för skildringar av könskörtlar som skapar spermier och könshormoner, bland annat testosteron.

Djur (hbtqi)
type: Concept
issued: 2022-05-19T10:12:00
modified: 2023-12-06T09:24:17
in scheme: Queerlit
related: Förvandlingssymbolik (hbtqi)
scope note: Används för skildringar av djur, förmänskligade eller ej, som framställs som att de genom genom begär, praktik, identitet och/eller kropp bryter mot hetero- och/eller cisnormer.
top concept of: Queerlit

Flator
type: Concept
issued: 2022-05-19T10:12:00
modified: 2022-05-19T10:12:00
broader: Skällsord
broader: Återvunna termer
in scheme: Queerlit
related: Lesbiska
scope note: Används för skildringar där begreppet fungerar som nedlåtande beskrivning av kvinnor som antas (men inte behöver) vara lesbiska. Kan även användas för skildringar där begreppet har återvunnits och uppvärderats som självidentifierande.

Domstolsbeslut
type: Concept
issued: 2022-05-19T10:12:00
modified: 2022-05-19T10:12:00
broader: Officiell dokumentation
broader: Juridik
hidden label: Domstols-beslut
in scheme: Queerlit
related: Körkort
scope note: Används för skildringar där domar och beslut från domstolar har betydelse för verket.

Kvinnors maskulinitet
type: Concept
issued: 2022-05-19T10:12:00
modified: 2022-12-19T10:09:02
alternative label: Feminin manlighet
alternative label: Feminin maskulinitet
alternative label: Kvinnlig manlighet
alternative label: Kvinnlig maskulinitet
alternative label: Kvinnors manlighet
alternative label: Manliga kvinnor
alternative label: Maskulina kvinnor
broader: Maskulinitet
in scheme: Queerlit
related: Pojkflickor
related: Butchar
scope note: Används för skildringar av personer som beskrivs som kvinnor och som använder attribut, beteenden eller roller som i allmänhet förknippas med män.

Amasoner
type: Concept
issued: 2022-05-19T10:12:00
modified: 2022-05-19T10:12:00
alternative label: Amazoner
broader: Kvinnor
in scheme: Queerlit
related: Antik symbolik (hbtqi)
related: Lesbiska
scope note: Används för skildringar av kvinnliga krigare i antik grekisk mytologi och för skildringar där begreppet använts generellt för kvinnliga krigare och/eller som en kulturell symbol i lesbiska sammanhang.

Sexuell revolution
type: Concept
issued: 2022-05-19T10:12:00
modified: 2022-05-19T10:12:00
alternative label: Sexuella frigörelsen
in scheme: Queerlit
related: Sociala processer (hbtqi)
scope note: Används för skildringar av de sociala rörelser som utmanade traditionella koder och beteenden relaterade till sexualitet och interpersonella relationer i västvärlden under 1960- och 1970-talet.
top concept of: Queerlit

Bitning (sexualitet)
type: Concept
issued: 2022-05-19T10:12:00
modified: 2022-05-19T10:12:00
broader: Oralsex
broader: Sexuella praktiker
in scheme: Queerlit
related: Vampyrism (sexualitet)
scope note: Används för skildringar av att skapa sexuell upphetsning genom att bitas.

Barn till queera personer
type: Concept
issued: 2022-05-19T10:12:00
modified: 2022-05-19T10:12:00
broader: Barn till hbtqi-personer
in scheme: Queerlit
related: Queera familjer
related: Queera föräldrar
scope note: Används för skildringar av barn till personer som beskrivs som queera.

Spekulationer (hbtqi)
type: Concept
issued: 2022-10-04T10:12:00
modified: 2023-12-06T09:24:17
in scheme: Queerlit
narrower: Ryktesspridning (hbtqi)
scope note: Används för skildringar av att spekulera - i positiv, negativ eller neutral anda - om någon annans sexuella läggning eller transitionserfarenhet.
top concept of: Queerlit

Rituell homosexualitet
type: Concept
issued: 2022-05-19T10:12:00
modified: 2022-05-19T10:12:00
broader: Homosexualitet
broader: Sexuella praktiker
in scheme: Queerlit
related: Ursprungsbefolkningar (hbtqi)
scope note: Används för skildringar av samkönade sexuella aktiviteter som sker som en del av en religiös eller kulturell rit, utan att de inblandade behöver identifiera sig som homosexuella.

Idrottare (hbtqi)
type: Concept
issued: 2024-03-19T10:08:14
modified: 2024-03-19T10:08:14
alternative label: Idrottskvinnor (hbtqi)
alternative label: Idrottsmän (hbtqi)
alternative label: Idrottspersoner (hbtqi)
broader: Hbtqi-personer
in scheme: Queerlit
related: Hbtqi-sportevenemang
related: Idrottsföreningar (hbtqi)
scope note: Används för skildringar av hbtqi-personer som är idrottare eller som återkommande är aktiva inom sport eller idrott.

Religiösa ledare (hbtqi)
type: Concept
issued: 2022-05-19T10:12:00
modified: 2023-12-06T09:24:17
alternative label: Imamer (hbtqi)
alternative label: Mobadān (hbtqi)
alternative label: Oshō (hbtqi)
alternative label: Pastorer (hbtqi)
alternative label: Präster (hbtqi)
alternative label: Rabbiner (hbtqi)
in scheme: Queerlit
related: Religion (hbtqi)
scope note: Används för skildringar av hbtqi-personer som är officiella eller inofficiella religiösa ledare (t.ex. präster, pastorer, imamer och rabbiner). Används även för skildringar av hbtqi-personers förhållningssätt till religiösa ledare eller religiösa ledares förhållningssätt till hbtqi.
top concept of: Queerlit

Bifobi
type: Concept
issued: 2022-05-19T10:12:00
modified: 2022-05-19T10:12:00
broader: Hbtqi-fobi
hidden label: Bi-fobi
in scheme: Queerlit
related: Bisexuella
related: Heterosexism
scope note: Används för skildringar av rädsla, avsky eller hat gentemot bisexuella eller de som antas vara bisexuella

Heterosexuella kvinnor
type: Concept
issued: 2022-05-19T10:12:00
modified: 2022-09-12T08:21:55
broader: Heterosexuella
broader: Kvinnor
in scheme: Queerlit
narrower: Faghags
scope note: Används för skildringar av heterosexuella kvinnor. Ämnesordet används för skildringar där identiteten som heterosexuell är i fokus.

Sexuella trakasserier
type: Concept
issued: 2022-05-19T10:12:00
modified: 2022-05-19T10:12:00
broader: Trakasserier
in scheme: Queerlit
related: Våld mot hbtqi-personer
related: Sexism
scope note: Används för skildringar av kränkande behandling eller bemötande av sexuell natur, som kränker den utsattas värdighet och/eller personliga integritet.

Dejtingsidor
type: Concept
issued: 2022-05-19T10:12:00
modified: 2023-03-29T10:53:01
alternative label: Dejtingsajter
alternative label: Nätdejting
broader: Sociala medier
hidden label: Dejting-sidor
in scheme: Queerlit
related: Dejtingappar
related: Dejtande (hbtqi)
scope note: Används för skildringar av hemsidor med syfte att låta användarna hitta personer att dejta.

Inseminering
type: Concept
issued: 2022-05-19T10:12:00
modified: 2022-05-19T10:12:00
alternative label: Insemination
broader: Skaffa barn (hbtqi)
in scheme: Queerlit
narrower: Självinseminering
related: Spermadonatorer
scope note: Används för skildringar av att med nålfri injektionsspruta, kateter eller liknande placera spermier i livmodern för att bli gravid.

Anala samlag
type: Concept
issued: 2022-05-19T10:12:00
modified: 2022-05-19T10:12:00
alternative label: Rövknull
broader: Analsex
broader: Samlag
in scheme: Queerlit
narrower: Barebacking
scope note: Används för skildringar av penetrerande analsex.

Par med olika hivstatus
type: Concept
issued: 2022-05-19T10:12:00
modified: 2022-06-07T15:09:28
alternative label: Serodiskordanta par
broader: Hbtqi-par
in scheme: Queerlit
related: Personer som lever med hiv
related: Hiv/aids
scope note: Används för skildringar av par där enbart ena parten lever med hiv.

Juridiskt kön
type: Concept
issued: 2022-05-19T10:12:00
modified: 2022-05-19T10:12:00
broader: Kön
in scheme: Queerlit
related: Officiell dokumentation
related: Tilldelat kön vid födseln
scope note: Används för skildringar där det kön som är registrerat i myndighetsregister, och används i id-handlingar med mera, har betydelse för verket.

Äldreboenden (hbtqi)
type: Concept
issued: 2022-05-19T10:12:00
modified: 2023-12-06T09:24:17
alternative label: Ålderdomshem (hbtqi)
hidden label: Äldre-boenden (hbtqi)
in scheme: Queerlit
related: Äldre hbtqi-personer
scope note: Används för skildringar av hbtqi-personer som vistas på äldreboenden samt för äldreboenden med hbtqi-personer som målgrupp.
top concept of: Queerlit

Relationer mellan okönade personer
type: Concept
issued: 2022-10-26T08:10:16
modified: 2022-10-26T08:10:16
broader: Relationer (hbtqi)
in scheme: Queerlit
related: Queera relationer
related: Transrelationer
scope note: Används för skildringar av nära relationer mellan okönade personer, där deras sexuella läggning inte framgår. Kan omfatta aspekter som släktskap, vänskap, sex eller kärlek.

Ickebinära barn
type: Concept
issued: 2022-05-19T10:12:00
modified: 2023-05-31T12:15:52
alternative label: Icke-binära barn
broader: Transbarn
broader: Ickebinära personer
in scheme: Queerlit
related: Föräldrar till ickebinära personer
scope note: Används för skildringar av barn som beskrivs som ickebinära.

Kondomer
type: Concept
issued: 2022-05-19T10:12:00
modified: 2022-05-19T10:12:00
broader: Preventivmedel
broader: Sexhjälpmedel
in scheme: Queerlit
related: Säkrare sex
scope note: Används för skildringar där kondomer har betydelse för verket.

Queera gemenskaper
type: Concept
issued: 2022-05-19T10:12:00
modified: 2023-03-29T10:25:38
alternative label: Queercommunityt
broader: Hbtqi-gemenskaper
hidden label: Queer-communityt
in scheme: Queerlit
related: Hbtqi+
related: Hbtqi
scope note: Används för skildringar av sociala gemenskaper där huvudsakligen queera personer interagerar.

Judendom (hbtqi)
type: Concept
issued: 2022-05-19T10:12:00
modified: 2023-12-06T09:24:17
alternative label: Judar (hbtqi)
broader: Religion (hbtqi)
broader: Etniska grupper (hbtqi)
in scheme: Queerlit
narrower: Androgynos
scope note: Används för skildringar av hbtqi-personer som är religiösa eller kulturella judar. Används även för skildringar av hbtqi-personers förhållningssätt till judendom eller andra judars förhållningssätt till hbtqi.

Dejtande (hbtqi)
type: Concept
issued: 2022-05-19T10:12:00
modified: 2023-12-06T09:24:17
alternative label: Att dejta (hbtqi)
alternative label: Dating (hbtqi)
alternative label: Dejting (hbtqi)
broader: Relationer (hbtqi)
in scheme: Queerlit
related: Dejtingappar
related: Dejtingsidor
scope note: Används för skildringar av hbtqi-personer som börjar träffa varandra i syfte att eventuellt inleda en romantisk eller sexuell relation.

Sodomiter
type: Concept
issued: 2022-05-19T10:12:00
modified: 2023-02-28T11:48:11
alternative label: Buggers
alternative label: Sodomister
broader: Historiska termer (hbtqi)
in scheme: Queerlit
related: Sodomi
related: Bugrar
scope note: Används för skildringar, historiska eller historiserande, som använder begreppet sodomiter - ett äldre ord som oftast syftar på män som har, eller antas ha, sex med män. Begreppet har även använts för personer som utför oönskat sex i bredare bemärkelse, t.ex. sex med djur eller heterosexuellt oral- eller analsex - ämnesordet ska inte användas då det uppenbart handlar om dessa fall.

Slicksex
type: Concept
issued: 2022-05-19T10:12:00
modified: 2022-05-19T10:12:00
broader: Oralsex
in scheme: Queerlit
narrower: Rimming
narrower: Cunnilingus
scope note: Används för skildringar av sexuella praktiker där tungan används för att ge sexuell tillfredsställelse eller upphetsning.

Dansare (hbtqi)
type: Concept
issued: 2022-05-19T10:12:00
modified: 2023-12-06T09:24:17
broader: Artister (hbtqi)
in scheme: Queerlit
related: Striptease
related: Voguing
scope note: Används för skildringar av hbtqi-personer som är dansare.

Hatbrottsoffer (hbtqi)
type: Concept
issued: 2022-05-19T10:12:00
modified: 2023-12-06T09:24:17
alternative label: Hbtqi-personer utsatta för hatbrott
alternative label: Offer för hatbrott (hbtqi)
broader: Brottsoffer (hbtqi)
hidden label: Hatbrotts-offer (hbtqi)
in scheme: Queerlit
related: Våld mot hbtqi-personer
related: Hatbrott
scope note: Används för skildringar av hbtqi-personer som utsatts för hatbrott.

Skolan (hbtqi)
type: Concept
issued: 2022-05-19T10:12:00
modified: 2023-12-06T09:24:17
alternative label: Gymnasier (hbtqi)
alternative label: Läroverk (hbtqi)
alternative label: Skolor (hbtqi)
alternative label: Undervisning (hbtqi)
in scheme: Queerlit
related: Situationsbetingat sexuellt beteende
scope note: Används för skildringar av skolor där hbtqi-personer förekommer - som elever, studenter, lärare eller i andra egenskaper - eller där hbtqi-tematik på annat sätt är framträdande. Ämnesordet används för alla nivåer av utbildningsinstitutioner från grundskola till universitet.
top concept of: Queerlit

Könssjukdomar
type: Concept
issued: 2022-05-19T10:12:00
modified: 2024-09-05T13:44:36
alternative label: STDs
alternative label: STIs
alternative label: Sexuellt överförbara infektioner
alternative label: Sexuellt överförbara sjukdomar
alternative label: Veneriska sjukdomar
in scheme: Queerlit
narrower: Hiv/aids
scope note: Används för skildringar där sjukdomar som smittar genom sexuellt umgänge har betydelse för verket.
top concept of: Queerlit

Sexturism
type: Concept
issued: 2022-05-19T10:12:00
modified: 2022-05-19T10:12:00
broader: Sexindustri
broader: Turism (hbtqi)
hidden label: Sex-turism
in scheme: Queerlit
related: Prostitution
scope note: Används för skildringar av resor som företas i syfte att köpa sexuella tjänster.

Hårborttagning
type: Concept
issued: 2022-05-19T10:12:00
modified: 2022-05-19T10:12:00
broader: Könsuttryck
broader: Könsbekräftande behandling
in scheme: Queerlit
related: Transitionering
scope note: Används för skildringar av hårborttagning, exempelvis för att få ett könsuttryck som stämmer överens med ens könsidentet.

Skådespelare (hbtqi)
type: Concept
issued: 2022-05-19T10:12:00
modified: 2023-12-06T09:24:17
alternative label: Skådespelerskor (hbtqi)
broader: Artister (hbtqi)
in scheme: Queerlit
narrower: Porrskådespelare
related: Konst (hbtqi)
scope note: Används för skildringar av hbtqi-personer som verkar som skådespelare.

Kompisvård (hbtqi)
type: Concept
issued: 2022-05-19T10:12:00
modified: 2023-12-06T09:24:17
alternative label: Buddies
alternative label: Buddy care
alternative label: Buddy-omsorg
alternative label: Buddy-vård
alternative label: Kamratomsorg (hbtqi)
alternative label: Kamratvård (hbtqi)
alternative label: Kompisomsorg (hbtqi)
broader: Hälso- och sjukvård (hbtqi)
in scheme: Queerlit
related: Personer som lever med hiv
related: Hiv/aids
scope note: Används för skildringar av peer-to-peer-form av hälso- och sjukvårdsstöd för hbtqi-personer där vänner eller volontärer bistår med vård och omsorg i hemmet eller följer med på patienters sjukvårdsbesök för att ge känslomässigt och logistiskt stöd.

Ockupationen av Socialstyrelsen 1979
type: Concept
issued: 2022-09-13T11:22:43
modified: 2022-09-13T11:22:43
broader: Aktionskampanjer (hbtqi)
in scheme: Queerlit
related: Civil olydnad (hbtqi)
related: Medikalisering
scope note: Används för skildringar av den ockupation som genomfördes av Socialstyrelsens trappa 29 augusti 1979, som syftade till att få myndigheten att stryka homosexualitet från sin klassifikation av sjukdomar.

Autoerotisk kvävning
type: Concept
issued: 2022-05-19T10:12:00
modified: 2024-09-05T13:44:36
alternative label: Asfyxiofili
alternative label: Autoerotisk strypning
alternative label: Hypoxyfili
alternative label: Strypsex
broader: Sexuella praktiker
broader: Sex
in scheme: Queerlit
related: Fetischism (sexualitet)
scope note: Används för skildringar av onani som involverar strypning eller kvävning.

Unga heterosexuella
type: Concept
issued: 2022-05-19T10:12:00
modified: 2022-05-19T10:12:00
alternative label: Heterosexuella ungdomar
broader: Heterosexuella
broader: Ungdomar
in scheme: Queerlit
related: Hbtqi-ungdomar
scope note: Används för skildringar av ungdomar som beskrivs som heterosexuella och där identiteten som heterosexuell är i fokus.

Tribader
type: Concept
issued: 2022-05-19T10:12:00
modified: 2022-05-19T10:12:00
broader: Historiska termer (hbtqi)
in scheme: Queerlit
related: Lesbiska
related: Frottage
scope note: Används för skildringar, historiska eller historiserande, som använder begreppet tribader - ett äldre ord för kvinnor som har, eller antas ha, sex med kvinnor.

Transmaskulina
type: Concept
issued: 2022-05-19T10:12:00
modified: 2022-09-12T08:21:55
broader: Transpersoner
hidden label: Trans-maskulina
in scheme: Queerlit
related: Maskulinitet
related: Maskuliniserande crossdressing
scope note: Används för skildringar av transpersoner med ett maskulint könsuttryck som beskrivs som transmaskulina.

Spermadonatorer
type: Concept
issued: 2022-05-19T10:12:00
modified: 2022-05-19T10:12:00
broader: Donatorer (medicin)
hidden label: Sperma-donatorer
in scheme: Queerlit
related: Inseminering
related: Skaffa barn (hbtqi)
scope note: Används för skildringar av personer som donerar sperma för att användas i assisterad befruktning. Det kan ske både inom sjukvård och privat, i hemmet eller liknande.

Flersamt föräldraskap
type: Concept
issued: 2022-05-19T10:12:00
modified: 2023-05-10T08:32:00
alternative label: Familjer med mer än två föräldrar
broader: Föräldrar (hbtqi)
in scheme: Queerlit
related: Polyamori
related: Flersamma relationer
scope note: Används för skildringar av flera personer som tillsammans är föräldrar till gemensamma barn, oavsett biologiskt släktskap.

Latent homosexualitet
type: Concept
issued: 2022-05-19T10:12:00
modified: 2022-05-19T10:12:00
in scheme: Queerlit
related: Förnekande av sexuell läggning
scope note: Används för skildringar där personer är omedvetna om sin potential till homosexuellt begär.
top concept of: Queerlit

Såna (hbtqi)
type: Concept
issued: 2022-05-19T10:12:00
modified: 2023-12-06T09:24:17
alternative label: Så'n (hbtqi)
alternative label: Så'na (hbtqi)
alternative label: Sådana (hbtqi)
alternative label: Sådandär (hbtqi)
alternative label: Sån (hbtqi)
alternative label: Sånadär (hbtqi)
broader: Historiska termer (hbtqi)
in scheme: Queerlit
related: Homosexuella
related: Fjollor
scope note: Används för skildringar, historiska eller historiserande, som använder begreppet såna för att referera till personer som antas vara homosexuella, framförallt män med feminina uttryck.

Bostonäktenskap
type: Concept
issued: 2022-05-19T10:12:00
modified: 2022-06-07T15:09:28
broader: Hbtqi-par
hidden label: Boston-äktenskap
in scheme: Queerlit
related: Lesbiska par
related: Historiska termer (hbtqi)
scope note: Används för skildringar av samboende kvinnor (ofta i romantisk relation) utan finansiellt stöd från någon man. Begreppet är ursprungligen från New England (USA) och användes under slutet av 1800-talet och början av 1900-talet.

Prostituerade lesbiska
type: Concept
issued: 2022-05-19T10:12:00
modified: 2023-03-29T10:25:38
broader: Lesbiska
broader: Prostituerade kvinnor
broader: Prostituerade homosexuella
in scheme: Queerlit
scope note: Används för skildringar av lesbiska som säljer eller har sålt sexuella tjänster.

Fosterfamiljer (hbtqi)
type: Concept
issued: 2022-05-19T10:12:00
modified: 2023-12-06T09:24:17
broader: Hbtqi-familjer
hidden label: Foster-familjer (hbtqi)
in scheme: Queerlit
narrower: Fosterföräldrar (hbtqi)
related: Adoption (hbtqi)
scope note: Används för skildringar av fosterfamiljer där en eller flera är hbtqi-personer.

Lesbiska par
type: Concept
issued: 2022-05-19T10:12:00
modified: 2022-06-07T15:09:28
broader: Lesbiska
broader: Homosexuella par
in scheme: Queerlit
related: Bostonäktenskap
scope note: Används för skildringar av parrelationer mellan lesbiska.

Musiker (hbtqi)
type: Concept
issued: 2022-05-19T10:12:00
modified: 2023-12-06T09:24:17
broader: Artister (hbtqi)
in scheme: Queerlit
related: Körer (hbtqi)
related: Konst (hbtqi)
scope note: Används för skildringar av hbtqi-personer som är musiker.

Feminister
type: Concept
issued: 2022-05-19T10:12:00
modified: 2022-05-19T10:12:00
in scheme: Queerlit
narrower: Suffragetter
scope note: Används för skildringar av personer som beskrivs som feminister. Med feminism avses en strävan efter jämlika politiska, ekonomiska och sociala rättigheter och möjligheter för kvinnor.
top concept of: Queerlit

Mänskliga rättigheter
type: Concept
issued: 2022-05-19T10:12:00
modified: 2022-05-19T10:12:00
in scheme: Queerlit
narrower: Medborgerliga rättigheter (hbtqi)
scope note: Används för skildringar där den del av folkrätten och internationell rätt som reglerar relationen mellan stat och individ har betydelse för verket. Utgångspunkten är att alla människor är födda fria, lika i värde och rättigheter.
top concept of: Queerlit

Omskärelse
type: Concept
issued: 2022-05-19T10:12:00
modified: 2022-05-19T10:12:00
alternative label: Manlig omskärelse
in scheme: Queerlit
related: Klitoridektomi
scope note: Används för skildringar av kirurgiskt avlägsnande av hela eller delar av förhuden på penis.
top concept of: Queerlit

Fysiskt funktionshindrade hbtqi-personer
type: Concept
issued: 2022-05-19T10:12:00
modified: 2023-12-06T09:24:17
alternative label: Fysiskt funktionsvarierade hbtqi-personer
alternative label: Hbtqi-personer med fysiska funktionsnedsättningar
broader: Hbtqi-personer
in scheme: Queerlit
narrower: Hbtqi-personer med synnedsättning
narrower: Döva hbtqi-personer
scope note: Används för skildringar av hbtqi-personer med fysiska funktionsvariationer i en hindrande omgivning. Hindren kan vara såväl bristande fysisk anpassning som normerande föreställningar om kroppslighet.

Intersexfobi
type: Concept
issued: 2022-05-19T10:12:00
modified: 2022-05-19T10:12:00
broader: Hbtqi-fobi
hidden label: Intersex-fobi
in scheme: Queerlit
related: Intersexpersoner
related: Heterosexism
scope note: Används för skildringar av rädsla, avsky eller hat gentemot intersexpersoner eller de som antas vara intersexpersoner.

Brottsprovokation
type: Concept
issued: 2022-05-19T10:12:00
modified: 2023-03-29T10:25:38
alternative label: Stingoperationer
broader: Polistrakasserier
hidden label: Brotts-provokation
hidden label: Sting-operationer
in scheme: Queerlit
related: Arresteringar av hbtqi-personer
related: Poliser
scope note: Används för skildringar av åtgärder, vanligtvis från polis och/eller åklagare, med syfte att påverka någon att begå ett brott för att sedan lagföra personen för brottet.

Mord på hbtqi-personer
type: Concept
issued: 2022-05-19T10:12:00
modified: 2023-12-06T09:24:17
alternative label: Mord på bisexuella
alternative label: Mord på bögar
alternative label: Mord på homosexuella
alternative label: Mord på intersexpersoner
alternative label: Mord på lesbiska
alternative label: Mord på queera
alternative label: Mord på transpersoner
broader: Våld mot hbtqi-personer
in scheme: Queerlit
related: Hatbrott
related: Döden och döende (hbtqi)
scope note: Används för skildringar av mord på hbtqi-personer.

Packing (fallos)
type: Concept
issued: 2022-05-19T10:12:00
modified: 2023-01-04T14:56:09
broader: Könsuttryck
broader: Könsöverskridanden
in scheme: Queerlit
related: Penisar
scope note: Används för skildringar av att med hjälp av en packer, stoppning eller annan form av fallosformat föremål i kläderna ge intryck av att ha en penis.

Hijre
type: Concept
issued: 2022-05-19T10:12:00
modified: 2022-11-23T07:52:04
alternative label: Hijra
alternative label: Hijras
alternative label: Jagappa
alternative label: Khawaja sira
alternative label: Khwaja sira
alternative label: Kinnar
alternative label: Kinner
broader: Könsöverskridanden
broader: Könsidentitet
in scheme: Queerlit
related: Eunucker
scope note: Används för skildringar av personer som beskrivs som hijre. Begreppet används i södra Asien för att beskriva ett tredje kön, och kan innefatta intersexpersoner, eunucker och transpersoner (vanligtvis med "kvinnligt" könsuttryck).

Två mammor
type: Concept
issued: 2022-05-19T10:12:00
modified: 2022-05-19T10:12:00
alternative label: Två morsor
alternative label: Två mödrar
broader: Mammor
in scheme: Queerlit
related: Lesbiska föräldrar
related: Bisexuella föräldrar
scope note: Används för skildringar av två mammor med gemensamma barn, oavsett mammornas läggning eller sexuella identitet. För bisexuella respektive lesbiska mammor, använd även ämnesordet "Bisexuella föräldrar" eller "Lesbiska föräldrar".

Singlar
type: Concept
issued: 2022-05-19T10:12:00
modified: 2022-05-19T10:12:00
alternative label: Enpersonshushåll
alternative label: Ensamstående
broader: Civilstånd
in scheme: Queerlit
narrower: Ensamstående föräldrar (hbtqi)
related: Skilda personer
scope note: Används för skildringar av personer som inte lever i en kärleksrelation och där deras liv som singlar är i fokus.

Intersexbarn
type: Concept
issued: 2022-05-19T10:12:00
modified: 2022-06-07T15:09:28
broader: Intersexpersoner
broader: Hbtqi-barn
hidden label: Intersex-barn
in scheme: Queerlit
related: Föräldrar till intersexpersoner
scope note: Används för skildringar av barn som beskrivs som intersexpersoner.

Stonewallupproret
type: Concept
issued: 2022-05-19T10:12:00
modified: 2024-09-05T13:44:36
alternative label: Stonewallkravallerna
alternative label: Stonewallupploppen
broader: Kravaller (hbtqi)
hidden label: Stonewall-kravallerna
hidden label: Stonewall-upploppen
hidden label: Stonewall-upproret
in scheme: Queerlit
related: Polistrakasserier
related: Hbtqi-frigörelse
scope note: Används för skildringar av eller referenser till den serie av våldsamheter i slutet av juni 1969 som uppstod i samband med en polisräd mot baren The Stonewall Inn i New York.

Hotell (hbtqi)
type: Concept
issued: 2022-05-19T10:12:00
modified: 2023-12-06T09:24:17
alternative label: Hbtqi-hotell
alternative label: Regnbågshotell
in scheme: Queerlit
related: Turism (hbtqi)
scope note: Används för skildringar av hotell där kopplingen till hbtqi har en framträdande betydelse.
top concept of: Queerlit

Sexualbrottslagstiftning
type: Concept
issued: 2022-05-19T10:12:00
modified: 2023-03-29T10:53:01
alternative label: Sexualstraffrätt
broader: Straffrätt
hidden label: Sexualbrotts-lagstiftning
in scheme: Queerlit
narrower: Antigaylagar
related: Sexuell myndighetsålder
scope note: Används för skildringar där den del av brottsbalken som reglerar sexualbrott, vilka straff som utgår och vad som definieras som sexualbrott, har en framträdande betydelse för verket.

Barn till intersexpersoner
type: Concept
issued: 2022-05-19T10:12:00
modified: 2022-05-19T10:12:00
alternative label: Barn till intersexuella
broader: Barn till hbtqi-personer
in scheme: Queerlit
related: Intersexfamiljer
related: Intersexföräldrar
scope note: Används för skildringar av barn till personer som beskrivs som intersexpersoner.

Barn till lesbiska
type: Concept
issued: 2022-05-19T10:12:00
modified: 2022-05-19T10:12:00
broader: Barn till homosexuella
in scheme: Queerlit
related: Lesbiska föräldrar
related: Lesbiska familjer
scope note: Används för skildringar av barn till personer som beskrivs som lesbiska.

Intersextillstånd
type: Concept
issued: 2022-05-19T10:12:00
modified: 2022-05-19T10:12:00
alternative label: 5-alfa-reduktas-brist
alternative label: Adrenogenitalt syndrom
alternative label: Androgenokänslighetssyndrom
alternative label: Avvikande könsutveckling
alternative label: DSD
alternative label: Differences of sexual development
alternative label: Disorders of sexual development
alternative label: Diverse sex development
alternative label: Intersexualism
alternative label: Klinefelters syndrom
alternative label: Partiellt androgenokänslighetssyndrom
alternative label: Progesteronmaskulinisering
alternative label: Rubbningar i könsutvecklingen
alternative label: Swyers syndrom
alternative label: Turners syndrom
alternative label: Varianter av könsutveckling
alternative label: XXY
broader: Biologiskt kön
broader: Medikalisering
hidden label: Intersex-tillstånd
in scheme: Queerlit
related: Intersexpersoner
scope note: Används för skildringar av de olika medfödda medicinska tillstånd vad gäller gener, könshormon och/eller könsorgan som gör att en person medicinskt inte entydigt kan kategoriseras som man eller kvinna. För skildringar som inte fokuserar på diagnos och behandling, använd ämnesordet "Intersexpersoner".

Cismän
type: Concept
issued: 2022-05-19T10:12:00
modified: 2023-03-29T10:25:38
broader: Cispersoner
broader: Män
hidden label: Cis-män
in scheme: Queerlit
related: AMAB
scope note: Används för skildringar av män som är cispersoner och där identiteten som cisman är i fokus.

Gemensam onani
type: Concept
issued: 2022-05-19T10:12:00
modified: 2022-05-19T10:12:00
alternative label: Ömsesidig onani
broader: Onani
broader: Sexuella praktiker
broader: Sex
in scheme: Queerlit
scope note: Används för skildringar av sexuell aktivitet som innebär att personer gemensamt onanerar.

Svärmisk vänskap
type: Concept
issued: 2022-05-19T10:12:00
modified: 2023-12-06T09:24:17
alternative label: Kärleksvänskap
alternative label: Romantisk vänskap
broader: Vänskap
in scheme: Queerlit
related: Kvinnors vänskap
related: Mäns vänskap
scope note: Används för skildringar av mycket nära, icke-sexuella relationer mellan vänner, präglade av intensiva romantiska eller svärmiska känslor.

Queera barn
type: Concept
issued: 2022-05-19T10:12:00
modified: 2022-06-07T15:09:28
broader: Hbtqi-barn
broader: Queera personer
in scheme: Queerlit
related: Föräldrar till queera personer
scope note: Används för skildringar av barn som beskrivs som queera.

Läkemedel
type: Concept
issued: 2022-05-19T10:12:00
modified: 2022-05-19T10:12:00
alternative label: Farmaka
alternative label: Mediciner
broader: Terapier och behandlingar
in scheme: Queerlit
narrower: PrEP
related: Hormonbehandling (kön)
scope note: Används för skildringar där varor med syfte att förebygga, lindra eller bota sjukdom eller skador har betydelse för verket.

Lesbofobi
type: Concept
issued: 2022-05-19T10:12:00
modified: 2022-05-19T10:12:00
broader: Homofobi
hidden label: Lesbo-fobi
in scheme: Queerlit
related: Lesbiska
related: Heterosexism
scope note: Används för skildringar av rädsla, avsky eller hat gentemot lesbiska eller de som antas vara lesbiska.

Paganism (hbtqi)
type: Concept
issued: 2022-05-19T10:12:00
modified: 2023-12-06T09:24:17
alternative label: Hedendom (hbtqi)
alternative label: Hedningar (hbtqi)
alternative label: Paganister (hbtqi)
broader: Religion (hbtqi)
in scheme: Queerlit
related: Gudinnerörelser (hbtqi)
related: Häxor (hbtqi)
scope note: Används för skildringar av hbtqi-personer som är paganister. Används även för skildringar av hbtqi-personers förhållningssätt till paganism eller andra paganisters förhållningssätt till hbtqi. Paganism definieras här som en modern form av naturreligioner i en västerländsk kontext.

Familjer med ensamstående föräldrar (hbtqi)
type: Concept
issued: 2022-05-19T10:12:00
modified: 2023-12-06T09:24:17
broader: Familjer med ensamstående föräldrar
in scheme: Queerlit
narrower: Ensamstående föräldrar (hbtqi)
scope note: Används för skildringar av familjer bestående av en vuxen hbtqi-person som lever ensam med barn och har ensam eller delad vårdnad där barnen bor hos föräldern på minst halvtid.

Transkultur
type: Concept
issued: 2022-05-19T10:12:00
modified: 2022-05-19T10:12:00
broader: Könsöverskridanden
broader: Subkulturer
hidden label: Trans-kultur
in scheme: Queerlit
related: Sexuell identitet
scope note: Används för skildringar av kulturer eller uttryck präglade av transpersoners interaktion eller deltagande.

Klittra
type: Concept
issued: 2022-05-19T10:12:00
modified: 2022-05-19T10:12:00
broader: Onani
broader: Sex med händerna
broader: Klitorissex
in scheme: Queerlit
scope note: Används för skildringar av sexuell stimulering med händerna av klitoris. Vanligtvis åsyftas onani men klittringen kan även utföras på eller av en annan person.

Före detta partners (hbtqi)
type: Concept
issued: 2022-05-19T10:12:00
modified: 2023-12-06T09:24:17
alternative label: Ex-partners (hbtqi)
broader: Partners (hbtqi)
in scheme: Queerlit
related: Skilda personer
related: Separationer (hbtqi)
scope note: Används för skildringar av före detta partners som är eller varit tillsammans med hbtqi-personer.

Demonstrationer (hbtqi)
type: Concept
issued: 2022-05-19T10:12:00
modified: 2023-12-06T09:24:17
broader: Hbtqi-aktivism
hidden label: Hbtqi-demonstrationer
in scheme: Queerlit
related: Kravaller (hbtqi)
related: Pride
scope note: Används för skildringar av demonstrationer där kopplingen till hbtqi har en framträdande betydelse.

Gummisubkultur
type: Concept
issued: 2022-05-19T10:12:00
modified: 2022-05-19T10:12:00
broader: Subkulturer
hidden label: Gummi-subkultur
in scheme: Queerlit
narrower: Gummisex
related: Lädergemenskaper
scope note: Används för skildringar av gemenskaper som präglas av samhörighet kring fetischerande av gummi- och latexkläder.

Älskare (hbtqi)
type: Concept
issued: 2022-05-19T10:12:00
modified: 2023-12-06T09:24:17
alternative label: Amant (hbtqi)
alternative label: Lovers (hbtqi)
alternative label: Älskarinnor (hbtqi)
broader: Hbtqi-personer
in scheme: Queerlit
related: Partners (hbtqi)
related: Sexuella relationer
scope note: Används för skildringar av hbtqi-personer som har en sexuell eller romantisk relation med någon, ofta utanför äktenskapet.

Skilsmässor (hbtqi)
type: Concept
issued: 2022-05-19T10:12:00
modified: 2023-12-06T09:24:17
broader: Separationer (hbtqi)
broader: Äktenskap
in scheme: Queerlit
related: Skilda personer
scope note: Används för skildringar av skilsmässor där någon eller alla parter är hbtqi-personer.

Avkriminalisering
type: Concept
issued: 2022-05-19T10:12:00
modified: 2024-06-05T11:38:19
alternative label: Dekriminalisering
broader: Straffrätt
hidden label: Av-kriminalisering
in scheme: Queerlit
related: Medborgerliga rättigheter (hbtqi)
related: Kriminalisering
scope note: Används för skildringar av strävandet mot och processen för att inte längre straffbelägga en handling - t.ex. samkönad sexuell aktivitet - som tidigare ansetts brottslig.

Androgynos
type: Concept
issued: 2022-05-19T10:12:00
modified: 2024-03-25T13:01:23
broader: Judendom (hbtqi)
broader: Könsidentitet
in scheme: Queerlit
related: Intersexpersoner
scope note: Används för skildringar av personer i judisk tradition med manliga och kvinnliga könskarakteristika. Kan även användas om dubbelkönade mytologiska varelser i rabbinsk tradition.

Kvinnors vänskap
type: Concept
issued: 2022-05-19T10:12:00
modified: 2023-12-06T09:24:17
alternative label: Kvinnlig vänskap
alternative label: Vänskap mellan kvinnor
broader: Vänskap
broader: Homosocialitet
in scheme: Queerlit
related: Svärmisk vänskap
scope note: Används för skildringar av vänskap mellan kvinnor.

Androgyna personer
type: Concept
issued: 2022-05-19T10:12:00
modified: 2022-06-07T15:09:28
broader: Transpersoner
in scheme: Queerlit
related: Androgynitet
related: Ickebinära personer
scope note: Används för skildringar av personer som beskrivs som androgyna - med könsuttryck eller könsidentiteter som inkluderar maskulina och feminina drag.

Binding (bröstkorg)
type: Concept
issued: 2022-05-19T10:12:00
modified: 2022-05-19T10:12:00
broader: Könsuttryck
in scheme: Queerlit
related: Transmän
related: Bröst
scope note: Används för skildringar av att med hjälp av lindor, en binder eller annan form av kompression platta till bröstvävnad.

Vänner (älskare)
type: Concept
issued: 2022-12-07T08:49:58
modified: 2022-12-07T08:49:58
alternative label: Väninnor (älskare)
broader: Historiska termer (hbtqi)
in scheme: Queerlit
related: Homosexuella
related: Homosexuella par
scope note: Används för skildringar, historiska eller historiserande, som använder begreppet vänner för att referera till personer som antas vara homosexuella, framförallt sådana som ingår i parrelationer. För vänskapsrelationer, använd ämnesordet "Vänskap" eller något av dess underordnade.

Homosexuella rörelser
type: Concept
issued: 2022-05-19T10:12:00
modified: 2022-08-16T12:51:11
alternative label: Homo-organisationer
alternative label: Organisationer för homosexuella
broader: Hbtqi-rörelser
in scheme: Queerlit
narrower: Bögrörelser
narrower: Lesbiska rörelser
scope note: Används för skildringar av sociala rörelser inriktade på homosexuellas rättigheter och levnadsvillkor.

Klitoridektomi
type: Concept
issued: 2022-05-19T10:12:00
modified: 2022-05-19T10:12:00
broader: Könsstympning av intersexpersoner
broader: Könsstympning
in scheme: Queerlit
related: Omskärelse
scope note: Används för skildringar av kirurgiskt borttagande av delar eller hela klitoris.

Homosexuella relationer
type: Concept
issued: 2022-05-19T10:12:00
modified: 2022-05-19T10:12:00
broader: Relationer (hbtqi)
in scheme: Queerlit
narrower: Bögrelationer
narrower: Lesbiska relationer
scope note: Används för skildringar av nära relationer mellan homosexuella. Kan omfatta aspekter som släktskap, vänskap, sex eller kärlek.

Pojkars vänskap
type: Concept
issued: 2022-05-19T10:12:00
modified: 2023-06-14T12:30:11
alternative label: Killars vänskap
alternative label: Killkompisar
broader: Vänskap
broader: Homosocialitet
in scheme: Queerlit
related: Pojkar
scope note: Används för skildringar av vänskapsrelationer mellan pojkar - i regel personer under 15 år.

Barn till bisexuella
type: Concept
issued: 2022-05-19T10:12:00
modified: 2022-05-19T10:12:00
broader: Barn till hbtqi-personer
in scheme: Queerlit
related: Bisexuella föräldrar
related: Bisexuella familjer
scope note: Används för skildringar av barn till personer som beskrivs som bisexuella.

Adopterade (hbtqi)
type: Concept
issued: 2022-05-19T10:12:00
modified: 2023-12-20T08:43:57
broader: Adoptivfamiljer (hbtqi)
in scheme: Queerlit
related: Adoptivföräldrar (hbtqi)
related: Adoption (hbtqi)
scope note: Används för skildringar av hbtqi-personer som är adopterade.

Dark rooms
type: Concept
issued: 2022-05-19T10:12:00
modified: 2022-12-07T08:49:58
alternative label: Backrooms
alternative label: Darkrooms
broader: Sexställen
in scheme: Queerlit
related: Sexklubbar
related: Sexfester
scope note: Används för skildringar av rum på nattklubbar eller sexklubbar som används för sexuella aktiviteter, ofta med dämpad belysning.

Kvinnorörelser
type: Concept
issued: 2022-05-19T10:12:00
modified: 2023-03-29T10:53:01
alternative label: Kvinnorörelsen
broader: Sociala rörelser
hidden label: Kvinno-rörelser
in scheme: Queerlit
related: Feminism
related: Lesbiska rörelser
scope note: Används för skildringar av sociala och politiska rörelser som på olika sätt arbetat för att stärka kvinnors rättigheter i samhället.

Hiv-/aidsaktivister
type: Concept
issued: 2022-05-19T10:12:00
modified: 2023-03-29T10:25:38
alternative label: Aidsaktivister
alternative label: Hivaktivister
broader: Hbtqi-aktivister
hidden label: Aids-aktivister
hidden label: Hiv-/aids-aktivister
hidden label: Hiv-aktivister
in scheme: Queerlit
related: Hiv/aids
related: Hbtqi-rörelser
scope note: Används för skildringar av aktivister med fokus på hiv- och aids-frågor, som rätt till sjukvård och läkemedel samt kamp mot förtryck av och fördomar mot aidssjuka och personer som lever med hiv.

Flickors vänskap
type: Concept
issued: 2022-05-19T10:12:00
modified: 2023-06-14T12:30:11
broader: Vänskap
broader: Homosocialitet
in scheme: Queerlit
related: Flickor
scope note: Används för skildringar av vänskap mellan flickor - i regel personer under 15 år.

Eunucker
type: Concept
issued: 2022-05-19T10:12:00
modified: 2022-05-19T10:12:00
alternative label: Kastrater
broader: Könsidentitet
in scheme: Queerlit
related: Hijre
related: Kastrering
scope note: Används för skildringar av personer med skadad testikelfunktion eller som blivit kastrerade. Historiskt har dessa i vissa samhällen haft särskilda roller som sångare, präster, tempeltjänare, kammartjänare eller haremsvakter.

Queerfobi
type: Concept
issued: 2022-05-19T10:12:00
modified: 2022-05-19T10:12:00
broader: Hbtqi-fobi
hidden label: Queer-fobi
in scheme: Queerlit
related: Heterosexism
related: Queera personer
scope note: Används för skildringar av rädsla, avsky eller hat gentemot queera personer eller de som antas vara queera personer.

Voguing
type: Concept
issued: 2022-10-04T10:12:00
modified: 2023-02-28T11:48:11
alternative label: Vogue (dans)
alternative label: Voguedans
broader: Ballroomkultur
in scheme: Queerlit
related: Dansare (hbtqi)
related: Konst (hbtqi)
scope note: Används för skildringar av dansen vogue, som kombinerar klassiska modellposer med raka kroppslinjer och skarpa vinklar, samt hårda ben-, arm- och kroppsrörelser.

Svartsjuka (hbtqi)
type: Concept
issued: 2022-05-19T10:12:00
modified: 2023-12-06T09:24:17
broader: Känslor (hbtqi)
in scheme: Queerlit
related: Relationer (hbtqi)
scope note: Används för skildringar av hbtqi-personer som upplever känslor av osäkerhet, oro, missunsamhet eller kontrollbehov i situationer där hens partner eller någon som är föremål för hens kärleksintresse upplevs värdera andra relationer mer, eller där det finns misstanke om otrohet i en monogam kontext.

Bögfamiljer
type: Concept
issued: 2022-05-19T10:12:00
modified: 2024-09-05T13:44:36
broader: Homosexuella familjer
hidden label: Bög-familjer
in scheme: Queerlit
related: Barn till bögar
related: Bögföräldrar
scope note: Används för skildringar av familjer bestående av vuxna bögar som lever med barn.

Buttpluggar
type: Concept
issued: 2022-05-19T10:12:00
modified: 2022-05-19T10:12:00
alternative label: Analplugg
broader: Sexhjälpmedel
in scheme: Queerlit
related: Analsex
related: Dildoar
scope note: Används för skildringar av sexuella hjälpmedel som förs in i rektum för anal stimulans.

Bokhandlar (hbtqi)
type: Concept
issued: 2022-05-19T10:12:00
modified: 2023-12-06T09:24:17
alternative label: Bokaffärer (hbtqi)
in scheme: Queerlit
narrower: Kvinnobokhandlar
scope note: Används för skildringar av bokhandlar där kopplingen till hbtqi har en framträdande betydelse.
top concept of: Queerlit

Lesbiska familjer
type: Concept
issued: 2022-05-19T10:12:00
modified: 2024-06-05T11:38:19
broader: Homosexuella familjer
in scheme: Queerlit
related: Lesbiska föräldrar
related: Barn till lesbiska
scope note: Används för skildringar av familjer bestående av vuxna lesbiska som lever med barn.

SM-rörelser
type: Concept
issued: 2022-05-19T10:12:00
modified: 2024-03-19T10:00:33
alternative label: Sadomasochism-rörelser
broader: Sociala rörelser
in scheme: Queerlit
related: SM
related: BDSM-gemenskaper
scope note: Används för skildringar av SM-föreningar, klubbar och andra gemenskaper, framförallt då dessa agerar för rättigheter eller vidgade möjligheter för gruppen.

Mäns vänskap
type: Concept
issued: 2022-05-19T10:12:00
modified: 2023-12-06T09:24:17
alternative label: Bromance
alternative label: Bromans
alternative label: Manlig vänskap
alternative label: Vänskap mellan män
broader: Vänskap
broader: Homosocialitet
in scheme: Queerlit
related: Svärmisk vänskap
scope note: Används för skildringar av vänskap mellan män.

Aversionsterapi (hbtqi)
type: Concept
issued: 2022-05-19T10:12:00
modified: 2023-12-06T09:24:17
broader: Terapier och behandlingar
hidden label: Aversions-terapi (hbtqi)
in scheme: Queerlit
related: Sexuell omvändelse
related: Ex-gayrörelser
scope note: Används för skildringar av behandling som syftar till att genom negativ stimuli, t.ex. elektriska stötar eller substanser som orsakar illamående, få en person att förknippa samkönat begär eller könsöverskridande med obehag och därmed åstadkomma en anpassning till hetero- och/eller cisnormen.

Homosexuell separatism
type: Concept
issued: 2022-05-19T10:12:00
modified: 2022-05-19T10:12:00
broader: Hbtqi-separatism
in scheme: Queerlit
narrower: Bögseparatism
narrower: Lesbisk separatism
scope note: Används för skildringar av frivillig ideologisk, social, kulturell och ibland fysisk separation av homosexuella från heterosexuella.

Barns sexualitet
type: Concept
issued: 2022-05-19T10:12:00
modified: 2022-05-19T10:12:00
broader: Sexualitet
in scheme: Queerlit
narrower: Sexuell myndighetsålder
related: Barn
scope note: Används för skildringar av barns sexuella beteenden, känslor och tankar.

Nudism
type: Concept
issued: 2022-05-19T10:12:00
modified: 2022-05-19T10:12:00
alternative label: Naturism
alternative label: Solbad
in scheme: Queerlit
related: Badplatser (hbtqi)
scope note: Används för skildringar av ett levnadssätt och en filosofi där kläder används så lite som möjligt och som framhåller gemensam nakenhet, humanistiska värderingar och fysisk och psykisk hälsa.
top concept of: Queerlit

Kollektiv (hbtqi)
type: Concept
issued: 2022-05-19T10:12:00
modified: 2023-12-06T09:24:17
broader: Samlevnadsformer
broader: Hbtqi-gemenskaper
in scheme: Queerlit
related: Valda familjer (hbtqi)
scope note: Används för skildringar av kollektiva boenden där kopplingen till hbtqi har en framträdande betydelse.

Heterosexuella barn
type: Concept
issued: 2022-05-19T10:12:00
modified: 2023-05-31T12:15:52
broader: Heterosexuella
broader: Barn
in scheme: Queerlit
narrower: Heterosexuella pojkar
narrower: Heterosexuella flickor
scope note: Används för skildringar av heterosexuella barn. Ämnesordet används för skildringar där identiteten som heterosexuell är i fokus.

Äldre homosexuella
type: Concept
issued: 2022-05-19T10:12:00
modified: 2024-03-19T10:00:33
alternative label: Gamla homosexuella
broader: Äldre hbtqi-personer
broader: Homosexuella
in scheme: Queerlit
narrower: Äldre lesbiska
narrower: Äldre bögar
scope note: Används för skildringar av äldre personer som beskrivs som homosexuella.

Hbtqi-aktivister
type: Concept
issued: 2022-05-19T10:12:00
modified: 2023-12-06T09:24:17
alternative label: Politiska aktivister (hbtqi)
broader: Hbtqi-personer
in scheme: Queerlit
narrower: Hiv-/aidsaktivister
related: Hbtqi-aktivism
related: Allierade
scope note: Används för skildringar av aktivister som fokuserar på hbtqi-personers rättigheter och levnadsvillkor.

Homosexuella gemenskaper
type: Concept
issued: 2022-05-19T10:12:00
modified: 2022-05-19T10:12:00
alternative label: Homosexuellt community
broader: Hbtqi-gemenskaper
in scheme: Queerlit
narrower: Böggemenskaper
narrower: Lesbiska gemenskaper
related: Homosexuella
scope note: Används för skildringar av sociala gemenskaper där huvudsakligen homosexuella interagerar.

Piskor
type: Concept
issued: 2022-05-19T10:12:00
modified: 2022-05-19T10:12:00
broader: Sexhjälpmedel
broader: BDSM
in scheme: Queerlit
related: Prygel
related: BDSM
scope note: Används för skildringar av pinnar, rep eller remmar, vanligtvis med styva handtag, som används i sexuella situationer för att slå någon i syfte att framkalla njutning.

Sexuella övergrepp (hbtqi)
type: Concept
issued: 2022-05-19T10:12:00
modified: 2023-12-06T09:24:17
alternative label: Våldäkt (hbtqi)
broader: Sexuellt våld
in scheme: Queerlit
related: Våld i nära relationer (hbtqi)
related: Offer för sexuella övergrepp (hbtqi)
related: Sexuellt samtycke
scope note: Används för skildringar av sexuella övergrepp mot eller begångna av hbtqi-personer.

Skilda personer
type: Concept
issued: 2022-05-19T10:12:00
modified: 2023-10-25T08:06:19
alternative label: Frånskilda personer
broader: Civilstånd
in scheme: Queerlit
related: Singlar
related: Före detta partners (hbtqi)
related: Skilsmässor (hbtqi)
scope note: Används för skildringar av personer som genomgått en skilsmässa.

Lädermammor
type: Concept
issued: 2022-05-19T10:12:00
modified: 2022-05-19T10:12:00
broader: Sexuella roller
broader: Läderkvinnor
broader: Läderfamiljer
in scheme: Queerlit
related: Läderpappor
scope note: Används för skildringar av kvinnor som är dominanta och/eller har en mentorsroll inom lädergemenskaper.

Medborgerliga rättigheter (hbtqi)
type: Concept
issued: 2022-05-19T10:12:00
modified: 2023-12-06T09:24:17
alternative label: Hbtqi-rättigheter
broader: Mänskliga rättigheter
in scheme: Queerlit
related: Könsstympning av intersexpersoner
related: Hbtqi-rörelser
related: Avkriminalisering
scope note: Används för skildringar av hur medborgerliga rättigheter används av eller förvägras hbtqi-personer.

Uranism
type: Concept
issued: 2022-05-19T10:12:00
modified: 2023-12-06T09:24:17
alternative label: Uraniadism
alternative label: Uranianism
alternative label: Uranismus
alternative label: Urningism
broader: Historiska termer (hbtqi)
in scheme: Queerlit
related: Inverterade
related: Sexuell inversion
related: Urningar
scope note: Används för skildringar, historiska eller historiserande, som använder begreppet uranism - ett under det sena 1800-talet och tidiga 1900-talet använt ord, främst för manlig homosexualitet, men inkluderande ett spektrum av hbtqi-identiteter och -praktiker.

Förvandlingssymbolik (hbtqi)
type: Concept
issued: 2022-05-19T10:12:00
modified: 2023-12-06T09:24:17
broader: Symbolik (hbtqi)
broader: Könsöverskridanden
hidden label: Förvandlings-symbolik (hbtqi)
in scheme: Queerlit
related: Djur (hbtqi)
related: Könsväxlingar
scope note: Används för skildringar där kroppslig förvandling används som symbolik för att signalera samkönade sexuella praktiker, känslor, identiteter och/eller överskridanden av binära könsnormer. Förvandlingen bör i någon mån vara magisk eller oförklarlig och behöver inte handla om att transformeras från ett kön till ett annat. Används inte för avsiktliga transitioneringserfarenheter.

Monogami
type: Concept
issued: 2022-05-19T10:12:00
modified: 2022-05-19T10:12:00
broader: Partnerpreferens
broader: Relationspreferens
broader: Sexuella relationer
in scheme: Queerlit
related: Sexuell identitet
scope note: Används för skildringar där monogama relationer - att ha kärleksrelationer med enbart en person vid en given tidpunkt - är i fokus.

Informationsförmedling
type: Concept
issued: 2022-05-19T10:12:00
modified: 2022-05-19T10:12:00
in scheme: Queerlit
narrower: Sexualundervisning
related: Medvetenhet om hiv/aids
scope note: Används för skildringar där ordnad förmedling av information, t.ex. om rättigheter, har betydelse för verket.
top concept of: Queerlit

Bastuklubbar
type: Concept
issued: 2022-05-19T10:12:00
modified: 2022-05-19T10:12:00
broader: Sexställen
broader: Uteliv (hbtqi)
hidden label: Bastu-klubbar
in scheme: Queerlit
related: Sexindustri
related: Offentligt sex
scope note: Används för skildringar av bad- och bastuinträttningar där personer, ofta män som har sex med män, möts för tillfälliga sexuella förbindelser.

Strap-onsex
type: Concept
issued: 2022-05-19T10:12:00
modified: 2022-05-19T10:12:00
alternative label: Sex med strap-on
alternative label: Straponsex
broader: Sex
in scheme: Queerlit
narrower: Samlag
related: Dildoar
related: Penisar
scope note: Används för skildringar av samlag där en dildo fastsatt på ett harness används för att penetrera.

Herrimitatörer
type: Concept
issued: 2022-05-19T10:12:00
modified: 2023-04-05T12:12:25
broader: Könsöverskridanden
broader: Teater (hbtqi)
hidden label: Herr-imitatörer
in scheme: Queerlit
related: Dragshower
related: Dragkings
scope note: Används för skildringar av personer som imiterar män på scen. Begreppet kan ses som en historisk variant av dragking, men kännetecknas mer av en strävan efter ett "realistiskt" iscensättande av maskulinitet, jämfört med mer överdrivna eller destabiliserande perspektiv i viss drag.

Vampyrism (sexualitet)
type: Concept
issued: 2022-05-19T10:12:00
modified: 2023-06-14T12:30:11
alternative label: Vampyrsex
broader: Fetischism (sexualitet)
broader: Sexuella praktiker
in scheme: Queerlit
related: Sexuell preferens
related: Bitning (sexualitet)
scope note: Används för skildringar av sex som av utövarna definieras som vampyrism eller med vampyrliknande inslag, främst genom att en utövare konsumerar andras blod.

Fistning
type: Concept
issued: 2022-05-19T10:12:00
modified: 2022-05-19T10:12:00
alternative label: Fisting
broader: Analsex
broader: Sex med händerna
broader: Vaginalsex
in scheme: Queerlit
related: Fingersex
scope note: Används för skildringar av sexuell aktivitet där en hand förs in i slidan eller anus.

Kvinnor som har sex med kvinnor
type: Concept
issued: 2022-05-19T10:12:00
modified: 2022-06-07T15:09:28
alternative label: KSK
alternative label: Samkönsälskande kvinnor
broader: Kvinnor
broader: Hbtqi-personer
in scheme: Queerlit
related: Lesbiska
related: Bisexuella kvinnor
scope note: Används för skildringar av kvinnor som har sex med andra kvinnor, oavsett hur dessa definierar sin sexuella läggning.

Kyssar
type: Concept
issued: 2022-05-19T10:12:00
modified: 2022-12-07T08:49:58
alternative label: Hångel
broader: Oralsex
broader: Sexuella praktiker
broader: Sex
broader: Kroppslig närhet
in scheme: Queerlit
scope note: Används för skildringar där kyssar har betydelse för verket.

Preventivmedel
type: Concept
issued: 2022-05-19T10:12:00
modified: 2022-05-19T10:12:00
in scheme: Queerlit
narrower: Kondomer
related: Säkrare sex
scope note: Används för skildringar där preventivmedel har betydelse för verket.
top concept of: Queerlit

Hbtqi-slang
type: Concept
issued: 2022-05-19T10:12:00
modified: 2023-12-06T09:24:17
alternative label: Polari
in scheme: Queerlit
narrower: Återvunna termer
related: Skällsord
scope note: Används för skildringar av vardagligt, specialiserat eller nyskapande gruppspråk bland hbtqi-personer.
top concept of: Queerlit

Transpojkar
type: Concept
issued: 2022-05-19T10:12:00
modified: 2023-12-13T10:57:15
alternative label: Transkillar
broader: Transmän
broader: Transbarn
broader: Pojkar
hidden label: Trans-killar
hidden label: Trans-pojkar
in scheme: Queerlit
related: Föräldrar till transmän
scope note: Används för skildringar av pojkar som beskrivs som transpersoner.

Queera föräldrar
type: Concept
issued: 2022-05-19T10:12:00
modified: 2022-06-07T15:09:28
broader: Föräldrar (hbtqi)
broader: Queera personer
in scheme: Queerlit
related: Barn till queera personer
related: Queera personer
scope note: Används för skildringar av queera personer som är föräldrar.

Fingersex
type: Concept
issued: 2022-05-19T10:12:00
modified: 2023-03-29T10:53:01
alternative label: Fingra
alternative label: Petting
alternative label: Pulla
alternative label: Smeksex
broader: Analsex
broader: Sex med händerna
broader: Vaginalsex
hidden label: Finger-sex
in scheme: Queerlit
related: Fistning
scope note: Används för skildringar av sexuell praktik som består av beröring eller penetrering med fingrar.

Sociala normer
type: Concept
issued: 2022-05-19T10:12:00
modified: 2022-05-19T10:12:00
in scheme: Queerlit
related: Rollbeteende
related: Normalisering
scope note: Används för skildringar där allmänt delade, många gånger outtalade, regler och förväntningar på beteenden inom en social gemenskap eller i samhället i stort har en framträdande betydelse för verket.
top concept of: Queerlit

Böggemenskaper
type: Concept
issued: 2022-05-19T10:12:00
modified: 2023-03-29T10:53:01
alternative label: Bögcommunity
broader: Homosexuella gemenskaper
hidden label: Bög-gemenskaper
in scheme: Queerlit
related: Hbtqi+
related: Bögar
related: Hbtqi
scope note: Används för skildringar av sociala gemenskaper där huvudsakligen bögar interagerar.

Porrskådespelare
type: Concept
issued: 2022-05-19T10:12:00
modified: 2024-09-05T13:44:36
alternative label: Pornografiska skådespelare
alternative label: Porrskådisar
alternative label: Porrstjärnor
broader: Sexarbetare (hbtqi)
broader: Skådespelare (hbtqi)
in scheme: Queerlit
related: Porrfilmer (hbtqi)
related: Gay for pay
scope note: Används för skildringar av personer som är kända på grund av medverkan i pornografiska filmer.

Demisexualitet
type: Concept
issued: 2022-05-19T10:12:00
modified: 2022-05-19T10:12:00
broader: Sexuell läggning
hidden label: Demi-sexualitet
in scheme: Queerlit
related: Asexualitet
related: Megasexualitet
related: Demisexuella
scope note: Används för skildringar av förmågan att enbart känna sexuell attraktion till någon efter att ha skapat ett starkt känslomässigt band till personen.

Gudinnerörelser (hbtqi)
type: Concept
issued: 2022-05-19T10:12:00
modified: 2023-12-06T09:24:17
alternative label: Gudinnedyrkan (hbtqi)
alternative label: Gudinnerörelsen (hbtqi)
hidden label: Gudinne-rörelser (hbtqi)
in scheme: Queerlit
related: Paganism (hbtqi)
related: Häxor (hbtqi)
scope note: Används för skildringar av (grupper av) personer som dyrkar eller hämtar inspiration från gudinnegestalter, i regel med feministiska perspektiv.
top concept of: Queerlit

Cybersex
type: Concept
issued: 2022-05-19T10:12:00
modified: 2023-12-06T09:24:17
alternative label: Internetsex
alternative label: Online sex
broader: Sexuella praktiker
in scheme: Queerlit
related: Internetsexarbetare (hbtqi)
related: Dejtingappar
related: Sexualitet
scope note: Används för skildringar av sexuella aktiviteter över internet.

Dejtingappar
type: Concept
issued: 2022-05-19T10:12:00
modified: 2023-03-29T10:53:01
alternative label: Datingappar
alternative label: Grindr
alternative label: HER
alternative label: Scruff
alternative label: Tinder
broader: Sociala medier
hidden label: Dejting-appar
in scheme: Queerlit
related: Cybersex
related: Dejtingsidor
related: Dejtande (hbtqi)
scope note: Används för skildringar av appar vars syfte är att låta användarna hitta personer att dejta.

Offentliga toaletter
type: Concept
issued: 2022-05-19T10:12:00
modified: 2023-02-22T13:41:50
alternative label: Mojar
alternative label: Pisskurar
alternative label: Pissmojar
alternative label: Pissoarer
broader: Sexställen
broader: Offentliga hygieninrättningar
in scheme: Queerlit
related: Passera (kön)
related: Sex på offentliga toaletter
scope note: Används för skildringar av rum eller små byggnader med en eller flera toaletter (eller urinoarer) som är tillgängliga för allmänheten, för kunder, skolelever, för anställda i ett företag eller annan liknande grupp.

Intersexgemenskaper
type: Concept
issued: 2022-05-19T10:12:00
modified: 2024-03-19T10:00:33
alternative label: Intersexcommunityt
broader: Hbtqi-gemenskaper
hidden label: Intersex-communityt
hidden label: Intersex-gemenskaper
in scheme: Queerlit
related: Hbtqi+
related: Intersexpersoner
related: Hbtqi
scope note: Används för skildringar av sociala gemenskaper där huvudsakligen intersexpersoner interagerar.

Transvestiter
type: Concept
issued: 2022-05-19T10:12:00
modified: 2022-11-16T11:33:32
broader: Historiska termer (hbtqi)
broader: Transpersoner
in scheme: Queerlit
related: Partners till transvestiter
related: Transvestism
scope note: Används för skildringar av personer som beskrivs som transvestiter. För skildringar av andra personer som, tillfälligt eller genomgående och oavsett anledning, bär kläder som associeras med ett annat kön än det de identifierar sig som, använd ämnesordet "Crossdressing".

Celibat
type: Concept
issued: 2022-05-19T10:12:00
modified: 2022-05-19T10:12:00
in scheme: Queerlit
related: Sexuell avhållsamhet
related: Asexuella
scope note: Används för skildringar av valet att leva i sexuell avhållsamhet och inte gifta sig.
top concept of: Queerlit

Självförtryck (hbtqi)
type: Concept
issued: 2022-05-19T10:12:00
modified: 2023-12-06T09:24:17
alternative label: Internaliserad hbtqi-fobi
alternative label: Internaliserat förtryck (hbtqi)
in scheme: Queerlit
related: Hbtqi-fobi
related: Förnekande av sexuell läggning
scope note: Används för skildringar av att applicera nedvärderande tankar kring sexualitet eller könsidentitet på sig själv utifrån rådande normer.
top concept of: Queerlit

Essentialism
type: Concept
issued: 2022-05-19T10:12:00
modified: 2022-05-19T10:12:00
alternative label: Biologisk essentialism
alternative label: Biologism
broader: Teorier (hbtqi)
in scheme: Queerlit
related: Queerteori
related: Sexuell identitet
related: Socialkonstruktivism
scope note: Används för skildringar där idéer om att kategorier som kön, sexuell läggning och etnicitet är naturligt givna - och att olika grupper bär på inneboende, oföränderliga egenskaper - har en framträdande betydelse för verket.

Intersexföräldrar
type: Concept
issued: 2022-05-19T10:12:00
modified: 2022-06-07T15:09:28
broader: Föräldrar (hbtqi)
broader: Intersexpersoner
hidden label: Intersex-föräldrar
in scheme: Queerlit
related: Intersexfamiljer
related: Barn till intersexpersoner
scope note: Används för skildringar av intersexpersoner som, ensamma eller tillsammans med andra, är föräldrar.

Badplatser (hbtqi)
type: Concept
issued: 2022-05-19T10:12:00
modified: 2023-12-06T09:24:17
alternative label: Badställen (hbtqi)
alternative label: Stränder (hbtqi)
in scheme: Queerlit
related: Hbtqi-mötesplatser
related: Nudism
scope note: Används för skildringar av badplatser där kopplingen till hbtqi har en framträdande betydelse.
top concept of: Queerlit

Tvångssterilisering
type: Concept
issued: 2022-05-19T10:12:00
modified: 2022-05-19T10:12:00
in scheme: Queerlit
related: Tvångsvård av hbtqi-personer
related: Kastrering
scope note: Används för skildringar av personer som ofrivilligt eller som en tvingande del av könsbekräftande behandling blir steriliserade.
top concept of: Queerlit

Röstträning (transpersoner)
type: Concept
issued: 2022-05-19T10:12:00
modified: 2022-05-19T10:12:00
broader: Könsuttryck
broader: Könsbekräftande behandling
in scheme: Queerlit
related: Transsexualism
related: Transitionering
scope note: Används för skildringar av icke-kirugiska tekniker för att få rösten att låta mer feminin eller maskulin i enlighet med önskat könsuttryck.

MtX
type: Concept
issued: 2022-05-19T10:12:00
modified: 2023-03-29T10:25:38
alternative label: M2X
alternative label: M2Xs
alternative label: Male-2-X
alternative label: Male-to-X
alternative label: Man-till-annat
alternative label: MtXs
broader: Transpersoner
in scheme: Queerlit
related: AMAB
related: FtX
related: Ickebinära personer
scope note: Används för skildringar av personer som beskrivs som MtX, vilket inkluderar transkvinnor/mtf/transfeminina och ickebinära som tilldelats manligt kön vid födseln.

AMAB
type: Concept
issued: 2023-03-29T10:25:38
modified: 2023-03-29T10:25:38
alternative label: Assigned male at birth
alternative label: Tilldelat manligt kön vid födseln
alternative label: Tillskrivet manligt kön vid födseln
broader: Tilldelat kön vid födseln
in scheme: Queerlit
related: MtX
related: Transkvinnor
related: Cismän
scope note: Används för skildringar av manligt kön som tilldelas ett barn vid födseln, baserat på hur barnets kropp tolkas. Används när det tilldelade könet har betydelse för verket, huvudsakligen i de fall där det inte överensstämmer med personers senare könsidentitet.

Sexuella riskbeteenden
type: Concept
issued: 2022-05-19T10:12:00
modified: 2022-05-19T10:12:00
in scheme: Queerlit
narrower: Barebacking
related: Säkrare sex
scope note: Används för skildringar av sexuella riskbeteenden, som exempelvis oskyddat sex med flertalet partners, med hänsyn till könssjukdomar och hiv.
top concept of: Queerlit

Förförelse
type: Concept
issued: 2022-05-19T10:12:00
modified: 2024-09-05T13:44:36
alternative label: Förförelseakt
in scheme: Queerlit
related: Raggning (hbtqi)
related: Sexualitet
scope note: Används för skildringar där någon medvetet avser att locka en annan person till sexuellt umgänge.
top concept of: Queerlit

Dragpappor
type: Concept
issued: 2022-05-19T10:12:00
modified: 2022-06-07T15:09:28
broader: Dragqueens
broader: Dragkings
broader: Dragfamiljer
hidden label: Drag-pappor
in scheme: Queerlit
related: Dragmammor
scope note: Används för skildringar av mer erfarna dragkings som är mentorer för mindre erfarna dragkings.

Hormonbehandling (kön)
type: Concept
issued: 2022-05-19T10:12:00
modified: 2024-09-05T13:44:36
alternative label: Testosteronbehandling
alternative label: Östrogenbehandling
broader: Könsbekräftande behandling
hidden label: Hormon-behandling (kön)
in scheme: Queerlit
related: Hormoner
related: Läkemedel
related: Transpersoner
scope note: Används för skildringar av könsbekräftande behandling med hormoner.

Pederaster
type: Concept
issued: 2022-05-19T10:12:00
modified: 2022-05-19T10:12:00
broader: Sexuell preferens
broader: Sexuell identitet
broader: Historiska termer (hbtqi)
in scheme: Queerlit
related: Pederasti
scope note: Används för skildringar, historiska eller historiserande, som använder begreppet pederaster - ett äldre ord som oftast syftar på vuxna män som har, eller önskar ha, erotiska förhållanden med tonårspojkar. Historiskt har begreppet även använts som synonym för både homosexuella män och pedofiler.

Uttrar (identitet)
type: Concept
issued: 2022-05-19T10:12:00
modified: 2022-06-07T15:09:28
broader: Bögkultur
broader: Bögar
broader: Sexuell identitet
in scheme: Queerlit
related: Björnar (identitet)
scope note: Används för skildringar av personer som beskrivs som tillhörande subkulturen uttrar. Subkulturen kännetecknas av smala och håriga bögar.

Transfobi
type: Concept
issued: 2022-05-19T10:12:00
modified: 2022-05-19T10:12:00
broader: Hbtqi-fobi
broader: Könsöverskridanden
hidden label: Trans-fobi
in scheme: Queerlit
related: Heterosexism
related: Transpersoner
scope note: Används för skildringar av rädsla, avsky eller hat gentemot transpersoner eller de som antas vara transpersoner.

Lesbiska rörelser
type: Concept
issued: 2022-05-19T10:12:00
modified: 2022-05-19T10:12:00
alternative label: Lesbiska organisationer
broader: Homosexuella rörelser
in scheme: Queerlit
related: Hbtqi-frigörelse
related: Lesbisk feminism
related: Kvinnorörelser
scope note: Används för skildringar av sociala rörelser inriktade på lesbiskas rättigheter och levnadsvillkor.

Socialkonstruktivism
type: Concept
issued: 2022-05-19T10:12:00
modified: 2022-05-19T10:12:00
broader: Teorier (hbtqi)
hidden label: Social-konstruktivism
in scheme: Queerlit
related: Queerteori
related: Medikalisering
related: Essentialism
scope note: Används för skildringar där idéer om att kategorier som kön, sexuell läggning och etnicitet är kulturella, historiska och/eller sociala konstruktioner snarare än naturligt givna har en framträdande betydelse för verket.

Substansmissbruk (hbtqi)
type: Concept
issued: 2022-05-19T10:12:00
modified: 2023-12-06T09:24:17
alternative label: Hbtqi-personer med substansberoende
alternative label: Hbtqi-personer med substansmissbruk
alternative label: Hbtqi-personer som lever i substansberoende
alternative label: Hbtqi-personer som lever i substansmissbruk
alternative label: Hbtqi-personer som missbrukar substanser
alternative label: Hbtqi-personer som är beroende av substanser
alternative label: Substansberoende hos hbtqi-personer
alternative label: Substansmissbruk hos hbtqi-personer
alternative label: Substansmissbrukande hbtqi-personer
hidden label: Substans-missbruk (hbtqi)
in scheme: Queerlit
narrower: Drogmissbruk (hbtqi)
narrower: Alkoholism (hbtqi)
scope note: Används för skildringar där hbtqi-personer missbrukar eller är beroende av substanser som narkotika, läkemedel eller alkohol. Med missbruk menas här sådant bruk som skadar hälsa och relationer.
top concept of: Queerlit

Kravaller (hbtqi)
type: Concept
issued: 2022-05-19T10:12:00
modified: 2023-12-06T09:24:17
alternative label: Gatustrider (hbtqi)
alternative label: Upplopp (hbtqi)
alternative label: Uppror (hbtqi)
in scheme: Queerlit
narrower: Stonewallupproret
related: Demonstrationer (hbtqi)
scope note: Används för skildringar av våldsamma oroligheter på offentlig plats, med ett större antal deltagande, där hbtqi-personer har en framträdande betydelse.
top concept of: Queerlit

Klitoris
type: Concept
issued: 2022-05-19T10:12:00
modified: 2022-05-19T10:12:00
broader: Könsorgan
broader: Erogena zoner
in scheme: Queerlit
narrower: G-punkten
related: Klitorissex
scope note: Används för skildringar där denna starkt sexuellt retbara del av fittan har betydelse för verket.

Mammor till homosexuella
type: Concept
issued: 2022-05-19T10:12:00
modified: 2022-06-07T15:09:28
alternative label: Homosexuellas mammor
alternative label: Homosexuellas mödrar
alternative label: Mödrar till homosexuella
broader: Föräldrar till homosexuella
broader: Mammor till hbtqi-personer
in scheme: Queerlit
narrower: Mammor till lesbiska
narrower: Mammor till bögar
scope note: Används för skildringar av mammor till homosexuella, oavsett mammans egen identitet.

Litterära salonger (hbtqi)
type: Concept
issued: 2022-05-19T10:12:00
modified: 2023-12-06T09:24:17
in scheme: Queerlit
related: Uteliv (hbtqi)
related: Bokcirklar (hbtqi)
scope note: Används för skildringar av litterära salonger - tillställningar där litteratur, kultur och aktuella ämnen diskuteras och där hbtqi-personer och/eller hbtqi-perspektiv har en framträdande betydelse.
top concept of: Queerlit

Camp
type: Concept
issued: 2022-05-19T10:12:00
modified: 2024-09-05T13:44:36
in scheme: Queerlit
related: Bögkultur
related: Dragartister
scope note: Används för skildringar av campkultur, en estetisk och kulturell stil som värdesätter ironi, kitsch och "dålig" smak.
top concept of: Queerlit

Garderobsbisexuella
type: Concept
issued: 2022-05-19T10:12:00
modified: 2022-06-07T15:09:28
broader: Bisexuella
hidden label: Garderobs-bisexuella
in scheme: Queerlit
related: Diskretion (hbtqi)
related: Outning
related: Komma ut
scope note: Används för skildringar av bisexuella personer som hemlighåller eller inte offentliggör sin sexuella läggning.

Massage
type: Concept
issued: 2022-05-19T10:12:00
modified: 2022-05-19T10:12:00
in scheme: Queerlit
narrower: Erotisk massage
related: Kroppslig närhet
scope note: Används för skildringar där fysisk behandling, som knådning och kramning, av muskler har betydelse för verket.
top concept of: Queerlit

Hiv-/aidsfobi
type: Concept
issued: 2022-05-19T10:12:00
modified: 2023-03-29T10:53:01
alternative label: Aidsfobi
alternative label: Hivfobi
alternative label: Hivstigma
alternative label: Rädsla för aids
alternative label: Rädsla för hiv
hidden label: Hiv-/aids-fobi
in scheme: Queerlit
related: Hbtqi-fobi
related: Hiv/aids
scope note: Används för skildringar av rädsla, avsky eller hat relaterat till hiv och aids - det kan röra sig om rädsla för att själv bli infekterad eller rädsla, avsky eller hat gentemot personer som lever med eller antas leva med hiv och/eller aids.
top concept of: Queerlit

AFAB
type: Concept
issued: 2023-03-29T10:25:38
modified: 2023-03-29T10:25:38
alternative label: Assigned female at birth
alternative label: Tilldelat kvinnligt kön vid födseln
alternative label: Tillskrivet kvinnligt kön vid födseln
broader: Tilldelat kön vid födseln
in scheme: Queerlit
related: Transmän
related: Ciskvinnor
related: FtX
scope note: Används för skildringar av kvinligt kön som tilldelas ett barn vid födseln, baserat på hur barnets kropp tolkas. Används när det tilldelade könet har betydelse för verket, huvudsakligen i de fall där det inte överensstämmer med personers senare könsidentitet.

Sexism
type: Concept
issued: 2022-05-19T10:12:00
modified: 2022-05-19T10:12:00
in scheme: Queerlit
related: Sexuella trakasserier
related: Heterosexism
scope note: Används för skildringar av fördomsladdad diskriminering, förtryck eller utnyttjande av människor på grund av könstillhörighet.
top concept of: Queerlit

Sexarbete
type: Concept
issued: 2022-05-19T10:12:00
modified: 2022-05-19T10:12:00
in scheme: Queerlit
narrower: Prostitution
related: Sexindustri
scope note: Används för skildringar av utbyte av sexuella tjänster, upphetsande sceniska framträdanden (striptease, webbkameramodellande) eller produkter mot materiell ersättning. Det inkluderar aktiviteter med direkt fysisk kontakt mellan köpare och säljare samt indirekt sexuell stimulering.
top concept of: Queerlit

Garderobsbögar
type: Concept
issued: 2022-05-19T10:12:00
modified: 2023-03-29T10:53:01
alternative label: Smygbögar
broader: Bögar
hidden label: Garderobs-bögar
in scheme: Queerlit
related: Diskretion (hbtqi)
related: Outning
related: Komma ut
scope note: Används för skildringar av bögar som hemlighåller eller inte offentliggör sin sexuella läggning.

Polisräder
type: Concept
issued: 2022-05-19T10:12:00
modified: 2023-03-29T10:53:01
alternative label: Polisrazzior
alternative label: Razzior
broader: Polistrakasserier
broader: Förföljelse av hbtqi-personer
hidden label: Polis-räder
in scheme: Queerlit
related: Arresteringar av hbtqi-personer
related: Poliser
scope note: Används för skildringar av överraskande polisiära ingripanden och undersökningar.

Lesbiska gemenskaper
type: Concept
issued: 2022-05-19T10:12:00
modified: 2022-05-19T10:12:00
alternative label: Lesbiskt community
broader: Homosexuella gemenskaper
in scheme: Queerlit
related: Hbtqi+
related: Lesbiska
related: Hbtqi
scope note: Används för skildringar av sociala gemenskaper där huvudsakligen lesbiska interagerar.

Bisexuella flickor
type: Concept
issued: 2022-05-19T10:12:00
modified: 2023-02-07T17:15:49
broader: Flickor
broader: Bisexuella kvinnor
broader: Bisexuella barn
in scheme: Queerlit
related: Kärlek mellan flickor
scope note: Används för skildringar av flickor som beskrivs som bisexuella.

Poliser
type: Concept
issued: 2022-05-19T10:12:00
modified: 2022-05-19T10:12:00
alternative label: Aina
alternative label: Ordningsmakten
alternative label: Polisen
alternative label: Poliskonstaplar
alternative label: Polistjänstemän
alternative label: Snutar
in scheme: Queerlit
related: Polisräder
related: Brottsprovokation
scope note: Används för skildringar av personer som arbetar som poliser.
top concept of: Queerlit

Transflickor
type: Concept
issued: 2022-05-19T10:12:00
modified: 2023-12-13T10:57:15
alternative label: Transtjejer
broader: Flickor
broader: Transbarn
broader: Transkvinnor
hidden label: Trans-flickor
hidden label: Trans-tjejer
in scheme: Queerlit
related: Föräldrar till transkvinnor
scope note: Används för skildringar av flickor som beskrivs som transpersoner.

Mobbning
type: Concept
issued: 2022-05-19T10:12:00
modified: 2022-05-19T10:12:00
alternative label: Mobbing
in scheme: Queerlit
related: Hbtqi-fobi
related: Trakasserier
scope note: Används för skildringar av systematiska trakasserier gentemot specifika personer inom en social grupp.
top concept of: Queerlit

Gummisex
type: Concept
issued: 2022-05-19T10:12:00
modified: 2022-05-19T10:12:00
broader: Sexuella praktiker
broader: Sex
broader: Gummisubkultur
hidden label: Gummi-sex
in scheme: Queerlit
related: SM
scope note: Används för skildringar av BDSM-praktik där en eller flera inblandade bär gummidräkt och/eller annan liknande klädsel, vilket orsakar nedsatt känsel på huden.

Kärlek mellan kvinnor
type: Concept
issued: 2022-05-19T10:12:00
modified: 2023-09-13T11:44:16
broader: Kärlek (hbtqi)
in scheme: Queerlit
narrower: Kärlek mellan flickor
related: Lesbiska
related: Bisexuella kvinnor
scope note: Används för skildringar av kärlek mellan kvinnor, oavsett hur dessa definierar sin sexuella läggning.

Sexköpare
type: Concept
issued: 2022-05-19T10:12:00
modified: 2022-12-07T08:49:58
alternative label: Laxar
alternative label: Torskar
in scheme: Queerlit
related: Sexarbetare (hbtqi)
related: Prostitution
scope note: Används för skildringar av personer som köper sexuella tjänster.
top concept of: Queerlit

Kärlek mellan flickor
type: Concept
issued: 2022-05-19T10:12:00
modified: 2023-06-14T12:30:11
alternative label: Kärlek mellan tjejer
broader: Kärlek mellan kvinnor
in scheme: Queerlit
related: Kär i kompis (hbtqi)
related: Bisexuella flickor
related: Lesbiska flickor
scope note: Används för skildringar av kärlek mellan flickor - i regel personer under 15 år - oavsett hur dessa definierar sin sexuella läggning.

Sexuell myndighetsålder
type: Concept
issued: 2022-05-19T10:12:00
modified: 2022-05-19T10:12:00
alternative label: Samtyckesålder
broader: Barns sexualitet
in scheme: Queerlit
related: Intergenerationella relationer
related: Sexualbrottslagstiftning
related: Sexuellt samtycke
scope note: Används för skildringar där åldern när en person anses mogen att ge samtycke till samlag har en framträdande betydelse för verket.

Pojkflickor
type: Concept
issued: 2022-05-19T10:12:00
modified: 2022-12-07T08:49:58
broader: Flickor
broader: Könsroller
in scheme: Queerlit
related: Kvinnors maskulinitet
related: Butchar
scope note: Används för skildringar av flickor som uppfattas som maskulina eller vars beteende och uttryck inte överensstämmer med traditionella feminina roller. Kan uppfattas som eller användas nedsättande.

Dragshower
type: Concept
issued: 2023-04-05T12:12:25
modified: 2023-04-05T12:12:25
alternative label: Drag shows
alternative label: Dragframträdanden
alternative label: Dragföreställningar
alternative label: Dragshows
alternative label: Draguppträdanden
broader: Konst (hbtqi)
hidden label: Drag-framträdanden
hidden label: Drag-föreställningar
hidden label: Drag-shower
hidden label: Drag-shows
hidden label: Drag-uppträdanden
in scheme: Queerlit
related: Herrimitatörer
related: Dragartister
related: Damimitatörer
scope note: Används för skildringar av framträdanden med personer som ikläder sig manligt eller kvinnligt kodade attribut, ofta i överdriven tappning, i underhållningssyfte och/eller som uttryck för en subkultur präglad av experimentella eller parodierande könsuttryck.

Garderobslesbiska
type: Concept
issued: 2022-05-19T10:12:00
modified: 2023-03-29T10:53:01
alternative label: Smygflator
alternative label: Smyglesbianer
alternative label: Smyglesbiska
broader: Lesbiska
hidden label: Garderobs-lesbiska
in scheme: Queerlit
related: Diskretion (hbtqi)
related: Outning
related: Komma ut
scope note: Används för skildringar av lesbiska som hemlighåller eller inte offentliggör sin sexuella läggning.

FtX
type: Concept
issued: 2022-05-19T10:12:00
modified: 2023-03-29T10:25:38
alternative label: F2X
alternative label: F2Xs
alternative label: Female-2-X
alternative label: Female-to-X
alternative label: FtXs
alternative label: Kvinna-till-annat
broader: Transpersoner
in scheme: Queerlit
related: MtX
related: AFAB
related: Ickebinära personer
scope note: Används för skildringar av personer som beskrivs som FtX, vilket inkluderar transmän/ftm/transmaskulina och ickebinära som tilldelats kvinnligt kön vid födseln.

Tvångsvård av hbtqi-personer
type: Concept
issued: 2022-05-19T10:12:00
modified: 2023-12-06T09:24:17
broader: Frihetsberövande av hbtqi-personer
in scheme: Queerlit
related: Elbehandling
related: Tvångssterilisering
related: Psykiatrisk vård (hbtqi)
scope note: Används för skildringar av vård av hbtqi-personer som sker mot den vårdades vilja eller oberoende av dennes samtycke.

Bisexuella pojkar
type: Concept
issued: 2022-05-19T10:12:00
modified: 2023-02-07T17:15:49
broader: Bisexuella män
broader: Pojkar
broader: Bisexuella barn
in scheme: Queerlit
related: Kärlek mellan pojkar
scope note: Används för skildringar av pojkar som beskrivs som bisexuella.

Partners till homosexuella
type: Concept
issued: 2022-05-19T10:12:00
modified: 2022-05-19T10:12:00
broader: Partners (hbtqi)
in scheme: Queerlit
narrower: Partners till bögar
narrower: Partners till lesbiska
related: Homosexuella
scope note: Används för skildringar av personer som är partners till homosexuella, oavsett partnerns egen identitet.

Bisexuella gemenskaper
type: Concept
issued: 2022-05-19T10:12:00
modified: 2022-05-19T10:12:00
alternative label: Bisexuellt community
broader: Hbtqi-gemenskaper
in scheme: Queerlit
related: Hbtqi+
related: Bisexuella
related: Hbtqi
scope note: Används för skildringar av sociala gemenskaper där huvudsakligen bisexuella interagerar.

Dyke march
type: Concept
issued: 2022-05-19T10:12:00
modified: 2022-05-19T10:12:00
broader: Hbtqi-evenemang
in scheme: Queerlit
related: Lesbiska
related: Trans march
related: Pride
scope note: Används för skildringar av demonstrationer för lesbisk synlighet, gemenskap och aktivism.

Dragmammor
type: Concept
issued: 2022-05-19T10:12:00
modified: 2022-06-07T15:09:28
broader: Dragqueens
broader: Dragkings
broader: Dragfamiljer
hidden label: Drag-mammor
in scheme: Queerlit
related: Dragpappor
scope note: Används för skildringar av mer erfarna dragqueens som är mentorer för mindre erfarna dragqueens.

Faeries
type: Concept
issued: 2022-05-19T10:12:00
modified: 2024-09-05T13:44:36
alternative label: Eurofaeries
alternative label: Faes
alternative label: Radical Faeries
broader: Bögkultur
broader: Sexuell identitet
in scheme: Queerlit
related: Schamanism (hbtqi)
related: Andlighet (hbtqi)
scope note: Används för skildringar av personer och grupper som beskrivs som faeries - ett löst sammansatt nätverk av personer som genom motkultur och andlighet vill omdefiniera hbtqi-identiteter.

Nyutkomna intersexpersoner
type: Concept
issued: 2022-05-19T10:12:00
modified: 2022-06-07T15:09:28
broader: Intersexpersoner
in scheme: Queerlit
related: Outning
related: Komma ut
related: Queera nyutkomna
scope note: Används för skildringar av personer som nyligen berättat för andra om, eller på annat sätt offentliggjort, att de är intersexpersoner.

Kvinnomän
type: Concept
issued: 2022-11-16T11:33:32
modified: 2022-11-16T11:33:32
alternative label: Kvinnoman
broader: Historiska termer (hbtqi)
in scheme: Queerlit
related: Bögar
related: Intersexpersoner
related: Transkvinnor
scope note: Används för skildringar, historiska eller historiserande, som använder begreppet kvinnomän - ett äldre ord som från det sena 1800-talet använts för att beskriva personer som på olika sätt inte ansetts uppfylla en förväntad heterosexuell mansidentitet, till exempel genom normbrytande feminin klädsel eller kroppslighet, eller genom att de antogs vara bögar.

Lesbisk feminism
type: Concept
issued: 2022-05-19T10:12:00
modified: 2022-05-19T10:12:00
broader: Feminism
in scheme: Queerlit
related: Lesbiska rörelser
related: Heterofeminism
related: Lesbisk separatism
scope note: Används för skildringar av den lesbiskfeministiska rörelsen, där lesbiskhet ses som något som är potentiellt möjligt för alla kvinnor och ett uttryck för motstånd mot heterosexism och könsmaktsordning.

Restauranger (hbtqi)
type: Concept
issued: 2022-05-19T10:12:00
modified: 2023-12-06T09:24:17
in scheme: Queerlit
related: Uteliv (hbtqi)
related: Turism (hbtqi)
scope note: Används för skildringar av restauranger som ägs, besöks, är arbetsplats för eller på annat vis är centrala för hbtqi-personer.
top concept of: Queerlit

Hbtqi-minnesmärken
type: Concept
issued: 2022-05-19T10:12:00
modified: 2023-12-06T09:24:17
in scheme: Queerlit
narrower: Aids-minnesmärken
related: Döden och döende (hbtqi)
scope note: Används för skildringar av offentliga skulpturer eller liknande vars syfte är att erinra om hbtqi-personer eller historiska händelser som påverkat hbtqi-personer.
top concept of: Queerlit

Dandyer
type: Concept
issued: 2022-05-19T10:12:00
modified: 2022-05-19T10:12:00
alternative label: Dandies
broader: Sexuell identitet
broader: Historiska termer (hbtqi)
in scheme: Queerlit
related: Könsuttryck
related: Dandyism
scope note: Används för skildringar av män med raffinerad klädsel, som ibland betraktas som "feminin", och uppträdande som kännetecknas av ett världsvant och elegant sätt.

Pappor till homosexuella
type: Concept
issued: 2022-05-19T10:12:00
modified: 2022-06-07T15:09:28
alternative label: Fäder till homosexuella
alternative label: Homosexuellas fäder
alternative label: Homosexuellas pappor
broader: Pappor till hbtqi-personer
broader: Föräldrar till homosexuella
in scheme: Queerlit
narrower: Pappor till bögar
narrower: Pappor till lesbiska
scope note: Används för skildringar av pappor till homosexuella, oavsett pappans egen identitet.

Bokcirklar (hbtqi)
type: Concept
issued: 2022-05-19T10:12:00
modified: 2023-12-06T09:24:17
in scheme: Queerlit
related: Hbtqi-föreningar
related: Litterära salonger (hbtqi)
scope note: Används för skildringar av bokcirklar där kopplingen till hbtqi har en framträdande betydelse.
top concept of: Queerlit

Bisexualitet
type: Concept
issued: 2022-05-19T10:12:00
modified: 2023-12-06T09:24:17
broader: Sexuell läggning
hidden label: Bi-sexualitet
in scheme: Queerlit
related: Homosexualitet
related: Bisexuella
related: Heterosexualitet
scope note: Används för skildringar av förmågan att känna sexuell och/eller romantisk attraktion till människor oavsett kön.

Unga bisexuella
type: Concept
issued: 2022-05-19T10:12:00
modified: 2022-09-13T11:22:43
alternative label: Bi-tonåringar
alternative label: Bi-ungdomar
alternative label: Bisexuella tonåringar
alternative label: Bisexuella ungdomar
broader: Bisexuella
broader: Hbtqi-ungdomar
in scheme: Queerlit
narrower: Unga bisexuella män
narrower: Unga bisexuella kvinnor
scope note: Används för skildringar av ungdomar som beskrivs som bisexuella.

Nyutkomna transpersoner
type: Concept
issued: 2022-05-19T10:12:00
modified: 2022-06-22T14:37:20
broader: Transpersoner
in scheme: Queerlit
related: Outning
related: Komma ut
related: Queera nyutkomna
scope note: Används för skildringar av personer som nyligen berättat för andra om, eller på annat sätt offentliggjort, att de är transpersoner.

Läderpappor
type: Concept
issued: 2022-05-19T10:12:00
modified: 2022-05-19T10:12:00
broader: Lädermän
broader: Sexuella roller
broader: Läderfamiljer
in scheme: Queerlit
related: Lädermammor
scope note: Används för skildringar av män som är dominanta och/eller har en mentorsroll inom lädergemenskaper.

Normalisering
type: Concept
issued: 2022-05-19T10:12:00
modified: 2022-05-19T10:12:00
alternative label: Assimilationism
alternative label: Assimilering
in scheme: Queerlit
related: Sociala processer (hbtqi)
related: Sociala normer
scope note: Används för skildringar av sociala processer där idéer, beteenden och handlingar börjar ses som "normala" och självklara. Brukas särskilt då denna process även innebär ett marginaliserande av gruppspecifika idéer, beteenden och handlingar till förmån för den föreställda majoritetens.
top concept of: Queerlit

Bröst
type: Concept
issued: 2022-05-19T10:12:00
modified: 2022-05-19T10:12:00
alternative label: Byst
alternative label: Tuttar
broader: Erogena zoner
in scheme: Queerlit
related: Bröstförstoring
related: Mastektomi
related: Binding (bröstkorg)
scope note: Används för skildringar av brösten - i regel parvis uppträdande, runda och utskjutande kroppsdelar på vuxna människors bröstkorg. Används inte för skildringar av bröst i betydelsen bröstkorg.

Migranter (hbtqi)
type: Concept
issued: 2022-05-19T10:12:00
modified: 2023-12-06T09:24:17
alternative label: Emigranter (hbtqi)
alternative label: Immigranter (hbtqi)
broader: Hbtqi-personer
in scheme: Queerlit
narrower: Papperslösa hbtqi-personer
narrower: Flyktingar (hbtqi)
related: Etniska grupper (hbtqi)
scope note: Används för skildringar av hbtqi-personer som flyttar från en plats till en annan, oftast i olika länder, med syfte att långvarigt bosätta sig på den nya platsen.

Förföljelse av homosexuella
type: Concept
issued: 2022-05-19T10:12:00
modified: 2022-05-19T10:12:00
broader: Förföljelse av hbtqi-personer
in scheme: Queerlit
narrower: Förföljelse av lesbiska
narrower: Förföljelse av bögar
related: Homosexuella
scope note: Används för skildringar av förföljelse av homosexuella på grund av deras sexuella läggning.

Fångar (hbtqi)
type: Concept
issued: 2022-05-19T10:12:00
modified: 2023-12-06T09:24:17
alternative label: Fängslade hbtqi-personer
alternative label: Hbtqi-fångar
alternative label: Intagna hbtqi-personer
broader: Hbtqi-personer
in scheme: Queerlit
narrower: Samvetsfångar (hbtqi)
related: Fängelsestraff (hbtqi)
related: Frihetsberövande av hbtqi-personer
scope note: Används för skildringar av fängslade hbtqi-personer.

Bröllop (hbtqi)
type: Concept
issued: 2022-05-19T10:12:00
modified: 2023-12-06T09:24:17
in scheme: Queerlit
related: Samboavtal
related: Äktenskap
scope note: Används för skildringar av bröllop där kopplingen till hbtqi har en framträdande betydelse.
top concept of: Queerlit

Män som har sex med män
type: Concept
issued: 2022-05-19T10:12:00
modified: 2024-09-05T13:44:36
alternative label: MSM
alternative label: Samkönsälskande män
broader: Hbtqi-personer
broader: Män
in scheme: Queerlit
related: Bögar
related: Bisexuella män
scope note: Används för skildringar av män som har sex med andra män, oavsett hur dessa definierar sin sexuella läggning.

Damimitatörer
type: Concept
issued: 2022-05-19T10:12:00
modified: 2023-04-05T12:12:25
alternative label: Damkomiker
broader: Könsöverskridanden
broader: Teater (hbtqi)
hidden label: Dam-imitatörer
in scheme: Queerlit
related: Dragqueens
related: Dragshower
scope note: Används för skildringar av personer som imiterar kvinnor på scen. Begreppet kan ses som en historisk variant av dragqueen, men kännetecknas mer av en strävan efter ett "realistiskt" iscensättande av femininitet, jämfört med mer överdrivna eller destabiliserande perspektiv i viss drag.

Telefonsex
type: Concept
issued: 2022-05-19T10:12:00
modified: 2022-05-19T10:12:00
broader: Sexuella praktiker
broader: Sex
in scheme: Queerlit
related: Sexindustri
related: Telefonsexarbetare
scope note: Används för skildringar av sexuellt explicita telefonsamtal med syfte att skapa upphetsning.

Agenderpersoner
type: Concept
issued: 2022-05-19T10:12:00
modified: 2022-06-07T15:09:28
broader: Transpersoner
in scheme: Queerlit
related: Könsidentitet
related: Okönade personer
related: Ickebinära personer
scope note: Används för skildringar av personer som beskrivs som agender - utan könsidentitet eller utan könstillhörighet.

Adoptivfamiljer (hbtqi)
type: Concept
issued: 2022-05-19T10:12:00
modified: 2023-12-06T09:24:17
broader: Hbtqi-familjer
hidden label: Adoptiv-familjer (hbtqi)
in scheme: Queerlit
narrower: Adoptivföräldrar (hbtqi)
narrower: Adopterade (hbtqi)
related: Adoption (hbtqi)
scope note: Används för skildringar av hbtqi-familjer där ett eller flera barn är adopterade.

Ballroomfamiljer
type: Concept
issued: 2022-05-19T10:12:00
modified: 2023-03-29T10:25:38
alternative label: Ballroomhus
broader: Ballroomkultur
broader: Valda familjer (hbtqi)
hidden label: Ballroom-familjer
hidden label: Ballroom-hus
in scheme: Queerlit
related: Icke-vita hbtqi-personer
related: Dragfamiljer
scope note: Används för skildringar av familjer, ett slags danskollektiv, inom ballroomkulturen.

Könsstympning
type: Concept
issued: 2022-05-19T10:12:00
modified: 2022-05-19T10:12:00
alternative label: Kvinnlig könsstympning
alternative label: Kvinnlig omskärelse
in scheme: Queerlit
narrower: Klitoridektomi
related: Könsstympning av intersexpersoner
scope note: Används för skildringar av borttagande av hela eller delar av vulvan, så som klitoris, yttre och inre blygdläppar, som inte sker med samtycke från personen.
top concept of: Queerlit

Prostituerade homosexuella
type: Concept
issued: 2022-05-19T10:12:00
modified: 2022-10-26T08:10:16
broader: Prostituerade
broader: Homosexuella
in scheme: Queerlit
narrower: Prostituerade bögar
narrower: Prostituerade lesbiska
scope note: Används för skildringar av lesbiska och bögar som säljer eller har sålt sexuella tjänster. För skildringar av enbart bögar eller lesbiska som säljer eller har sålt sexuella tjänster, använd ämnesorden "Prostituerade bögar" respektive "Prostituerade lesbiska".

Smiskning
type: Concept
issued: 2022-05-19T10:12:00
modified: 2022-05-19T10:12:00
broader: SM
broader: Sexuella praktiker
in scheme: Queerlit
related: BDSM
related: Skinkor
scope note: Används för skildringar av smisk i en sexuell kontext.

Ex-gayrörelser
type: Concept
issued: 2022-05-19T10:12:00
modified: 2022-05-19T10:12:00
broader: Sociala rörelser
in scheme: Queerlit
related: Sexuell omvändelse
related: Heterosexism
related: Aversionsterapi (hbtqi)
scope note: Används för skildringar av de rörelser som verkar för sexuell omvändelse av eller avhållsamhet för homo- och bisexuella.

Barnlängtan
type: Concept
issued: 2022-05-19T10:12:00
modified: 2022-05-19T10:12:00
hidden label: Barn-längtan
in scheme: Queerlit
related: Barn
related: Skaffa barn (hbtqi)
scope note: Används för skildringar av längtan efter att få barn.
top concept of: Queerlit

Sexmissbruk
type: Concept
issued: 2022-05-19T10:12:00
modified: 2024-09-05T13:44:36
alternative label: Beroende av sex
alternative label: Missbruk av sex
alternative label: Sexberoende
alternative label: Sexoholism
alternative label: Sexuell beroendeproblematik
alternative label: Sexuellt beroende
alternative label: Tvångsmässigt sexuellt beteende
hidden label: Sex-missbruk
in scheme: Queerlit
narrower: Hypersexualitet
related: Exhibitionism
scope note: Används för skildringar av ett tvångsmässigt sexuellt beteende som personen inte har kontroll över.
top concept of: Queerlit

Tredje könet
type: Concept
issued: 2022-05-19T10:12:00
modified: 2022-05-19T10:12:00
alternative label: 3:e könet
broader: Könsöverskridanden
broader: Könsidentitet
broader: Historiska termer (hbtqi)
in scheme: Queerlit
related: Tredje kön-personer
scope note: Används för skildringar av en tredje könskategori, antingen i samhällen där en sådan erkänns eller i historiska eller historiserande skildringar där begreppet brukas.

Mankvinnor
type: Concept
issued: 2022-05-19T10:12:00
modified: 2023-03-29T10:53:01
alternative label: Maninna
alternative label: Maninnor
alternative label: Mankvinna
alternative label: Manskvinna
alternative label: Manskvinnor
broader: Historiska termer (hbtqi)
hidden label: Man-kvinnor
in scheme: Queerlit
related: Transmän
related: Lesbiska
related: Intersexpersoner
scope note: Används för skildringar, historiska eller historiserande, som använder begreppet mankvinnor - ett äldre ord som från det sena 1800-talet använts för att beskriva personer som på olika sätt inte ansetts uppfylla en förväntad heterosexuell kvinnoidentitet, till exempel genom normbrytande maskulin klädsel eller kroppslighet, eller genom att de antogs vara lesbiska.

Diskrimineringslagstiftning
type: Concept
issued: 2022-05-19T10:12:00
modified: 2023-03-29T10:25:38
alternative label: Antidiskrimineringslagar
alternative label: Antidiskrimineringslagstiftning
alternative label: Diskrimineringslagar
alternative label: Diskrimineringslagen
broader: Juridik
hidden label: Anti-diskrimineringslagar
hidden label: Anti-diskrimineringslagstiftning
hidden label: Diskriminerings-lagen
hidden label: Diskriminerings-lagstiftning
in scheme: Queerlit
related: Offentliga hygieninrättningar
related: Diskriminering av hbtqi-personer
related: Rasism (hbtqi)
scope note: Används för skildringar där lagstiftning med syfte att motverka diskriminering har betydelse för verket. Sådan lagstiftning syftar till att främja lika rättigheter och möjligheter oavsett kön, könsöverskridande identitet eller uttryck, etnisk tillhörighet, religion eller annan trosuppfattning, funktionsnedsättning, sexuell läggning eller ålder.

Häxor (hbtqi)
type: Concept
issued: 2022-05-19T10:12:00
modified: 2023-12-06T09:24:17
in scheme: Queerlit
related: Gudinnerörelser (hbtqi)
related: Paganism (hbtqi)
scope note: Används för skildringar av häxor - personer som tros ha övernaturliga krafter eller magiska kunskaper - där kopplingen till hbtqi har en framträdande betydelse och/eller där begreppet används som en kulturell symbol i hbtqi-sammanhang.
top concept of: Queerlit

Andlighet (hbtqi)
type: Concept
issued: 2022-05-19T10:12:00
modified: 2023-12-06T09:24:17
alternative label: Spiritualitet (hbtqi)
in scheme: Queerlit
related: Religion (hbtqi)
related: Faeries
scope note: Används för skildringar av hbtqi-personers erfarenheter av eller sökande efter översinnliga upplevelser.
top concept of: Queerlit

Äldre bisexuella
type: Concept
issued: 2022-05-19T10:12:00
modified: 2024-03-19T10:00:33
alternative label: Gamla bisexuella
broader: Äldre hbtqi-personer
broader: Bisexuella
in scheme: Queerlit
narrower: Äldre bisexuella kvinnor
narrower: Äldre bisexuella män
scope note: Används för skildringar av äldre personer som beskrivs som bisexuella.

Kärlek mellan män
type: Concept
issued: 2022-05-19T10:12:00
modified: 2023-02-07T17:15:49
broader: Kärlek (hbtqi)
in scheme: Queerlit
narrower: Kärlek mellan pojkar
related: Bögar
related: Bisexuella män
scope note: Används för skildringar av kärlek mellan män, oavsett hur dessa definierar sin sexuella läggning.

Medvetenhet om hiv/aids
type: Concept
issued: 2022-05-19T10:12:00
modified: 2022-05-19T10:12:00
in scheme: Queerlit
related: Informationsförmedling
related: Hiv/aids
scope note: Används för skildringar där information och utbildning om förebyggande av hiv/aids eller arbete mot missuppfattningar om hiv-viruset och sjukdomen aids har betydelse för verket.
top concept of: Queerlit

Psykiatrisk vård (hbtqi)
type: Concept
issued: 2022-05-19T10:12:00
modified: 2023-12-06T09:24:17
alternative label: Psykiatrisk vård för hbtqi-personer
alternative label: Psykvård för hbtqi-personer
broader: Hälso- och sjukvård (hbtqi)
in scheme: Queerlit
related: Suicid (hbtqi)
related: Tvångsvård av hbtqi-personer
related: Terapier och behandlingar
scope note: Används för skildringar av hbtqi-personer som får sjukvård som behandlar psykiatriska besvär och sjukdomar.

Unga homosexuella
type: Concept
issued: 2022-05-19T10:12:00
modified: 2023-01-11T08:39:46
alternative label: Homosexuella tonåringar
alternative label: Homosexuella ungdomar
alternative label: Unga lesbiska och bögar
broader: Homosexuella
broader: Hbtqi-ungdomar
in scheme: Queerlit
narrower: Unga lesbiska
narrower: Unga bögar
scope note: Används för skildringar av ungdomar som beskrivs som homosexuella.

Allierade
type: Concept
issued: 2022-05-19T10:12:00
modified: 2023-12-06T09:24:17
broader: Hbtqi-aktivism
in scheme: Queerlit
related: Hbtqi-aktivister
related: Heterosexuella
related: Cispersoner
scope note: Används för skildringar av personer som inte själva är hbtqi-personer men stödjer och aktivt deltar i hbtqi-rörelsen.

Kemsex
type: Concept
issued: 2023-06-14T12:30:11
modified: 2023-06-14T12:30:11
alternative label: Chem-sex
alternative label: Chemsex
alternative label: Kem-sex
alternative label: Party and play
alternative label: PnP
alternative label: Sexualiserat droganvändande
broader: Sexuella praktiker
broader: Droganvändning (hbtqi)
broader: Sex
in scheme: Queerlit
related: Poppers
scope note: Används för skildringar av sex där droger används för att intensifiera sinnesupplevelsen och/eller öka den sexuella förmågan.

Bisexuella familjer
type: Concept
issued: 2022-05-19T10:12:00
modified: 2022-05-19T10:12:00
broader: Hbtqi-familjer
in scheme: Queerlit
related: Bisexuella
related: Bisexuella föräldrar
related: Barn till bisexuella
scope note: Används för skildringar av familjer bestående av vuxna bisexuella som lever med barn.

Orgasm
type: Concept
issued: 2022-05-19T10:12:00
modified: 2022-05-19T10:12:00
broader: Sexuell upphetsning
in scheme: Queerlit
related: G-punkten
related: Sexualitet
related: Sex
scope note: Används för skildringar där sexuell utlösning och urladdning har betydelse för verket.

Kärlek mellan pojkar
type: Concept
issued: 2022-05-19T10:12:00
modified: 2023-06-14T12:30:11
alternative label: Kärlek mellan killar
broader: Kärlek mellan män
in scheme: Queerlit
related: Kär i kompis (hbtqi)
related: Bisexuella pojkar
related: Homosexuella pojkar
scope note: Används för skildringar av kärlek mellan pojkar - i regel personer under 15 år - oavsett hur dessa definierar sin sexuella läggning.

Two-spirit
type: Concept
issued: 2022-05-19T10:12:00
modified: 2022-05-19T10:12:00
alternative label: Two-spirit-personer
alternative label: Twospirit
alternative label: Twospirit-personer
broader: Könsöverskridanden
broader: Könsidentitet
in scheme: Queerlit
related: Ursprungsamerikaner (hbtqi)
related: Ursprungsbefolkningar (hbtqi)
scope note: Används för skildringar av personer som beskrivs som two-spirit. Begreppet används som modern självidentifikation bland nordamerikanska urfolk för personer som faller utanför tvåkönsnormen.

Juridiskt namn
type: Concept
issued: 2022-05-19T10:12:00
modified: 2022-05-19T10:12:00
broader: Familjerätt (hbtqi)
in scheme: Queerlit
related: Namnändring
related: Pass
related: Officiell dokumentation
related: Körkort
scope note: Används för skildringar där myndigheters registrering av namn har betydelse för verket.

Raggning (hbtqi)
type: Concept
issued: 2022-05-19T10:12:00
modified: 2023-12-06T09:24:17
alternative label: Raggande (hbtqi)
broader: Sexuella praktiker
broader: Sex
in scheme: Queerlit
narrower: Cruising
related: Förförelse
related: Tillfälligt sex
scope note: Används för skildringar av att leta efter en, vanligtvis tillfällig, sexpartner.

Porrfilmer (hbtqi)
type: Concept
issued: 2022-05-19T10:12:00
modified: 2023-12-06T09:24:17
alternative label: Pornografiska filmer (hbtqi)
in scheme: Queerlit
related: Porrskådespelare
related: Porrindustri
related: Porrbiografer
scope note: Används för skildringar av pornografiska filmer där det förekommer samkönat sex och/eller könsöverskridande gestaltningar.
top concept of: Queerlit

Äldre transpersoner
type: Concept
issued: 2022-05-19T10:12:00
modified: 2022-11-23T07:43:01
alternative label: Gamla transpersoner
broader: Äldre hbtqi-personer
broader: Transpersoner
in scheme: Queerlit
narrower: Äldre transmän
narrower: Äldre ickebinära
narrower: Äldre transkvinnor
scope note: Används för skildringar av äldre personer som beskrivs som trans.

Striptease
type: Concept
issued: 2022-05-19T10:12:00
modified: 2023-02-28T11:48:11
alternative label: Strippa
alternative label: Striptease-dans
broader: Sexuella praktiker
broader: Sexindustri
broader: Teater (hbtqi)
in scheme: Queerlit
related: Strippor
related: Dansare (hbtqi)
scope note: Används för skildringar av erotisk eller burlesk dans där dansaren/dansarna stegvis klär av sig.

Äktenskapslagstiftning
type: Concept
issued: 2022-05-19T10:12:00
modified: 2022-05-19T10:12:00
broader: Familjerätt (hbtqi)
hidden label: Äktenskaps-lagstiftning
in scheme: Queerlit
narrower: Samvetsäktenskap
related: Registrerade partnerskap
related: Civilstånd
related: Äktenskap
scope note: Används för skildringar där den del av juridiken som avhandlar äktenskap har en framträdande betydelse för verket.

Kär i kompis (hbtqi)
type: Concept
issued: 2022-05-19T10:12:00
modified: 2023-12-06T09:24:17
alternative label: Kär i en kompis (hbtqi)
alternative label: Kär i en vän (hbtqi)
alternative label: Kär i vän (hbtqi)
broader: Kärlek (hbtqi)
in scheme: Queerlit
related: Obesvarad kärlek (hbtqi)
related: Vänskap
related: Kärlek mellan flickor
related: Kärlek mellan pojkar
scope note: Används för skildringar där en hbtqi-person är kär i en kompis, oavsett om kärleken är besvarad eller ej.

Allosexualitet
type: Concept
issued: 2022-05-19T10:12:00
modified: 2024-03-25T13:01:23
broader: Sexuell läggning
hidden label: Allo-sexualitet
in scheme: Queerlit
related: Heterosexuella
related: Homosexuella
related: Bisexuella
related: Pansexuella
scope note: Används för skildringar där begreppet allosexualitet används för att beskriva förmågan att känna sexuell attraktion eller vilja till sexuella relationer med andra personer, i relation till motsatsen asexualitet.

Queerteori
type: Concept
issued: 2022-05-19T10:12:00
modified: 2022-05-19T10:12:00
broader: Teorier (hbtqi)
hidden label: Queer-teori
in scheme: Queerlit
related: Essentialism
related: Socialkonstruktivism
related: Genusvetenskap
related: Queerstudier
scope note: Används för skildringar där queerteori - ett vetenskapligt perspektiv som undersöker normer och konstruktioner av kön och sexualitet - har betydelse för verket.

Hbtqi-barer
type: Concept
issued: 2022-05-19T10:12:00
modified: 2024-09-05T13:44:36
alternative label: Bibarer
alternative label: Bögbarer
alternative label: Flatbarer
alternative label: Gaybarer
alternative label: Hbt-barer
alternative label: Hbtq-barer
alternative label: Intersexbarer
alternative label: Lesbiska barer
alternative label: Queerbarer
alternative label: Regnbågsbarer
alternative label: Transbarer
in scheme: Queerlit
related: Hbtqi-mötesplatser
related: Hbtqi-klubbar
related: Uteliv (hbtqi)
scope note: Används för skildringar av barer som främst besöks av och/eller drivs av hbtqi-personer.
top concept of: Queerlit

Könsidentitetsutredning
type: Concept
issued: 2022-05-19T10:12:00
modified: 2023-03-29T10:53:01
alternative label: Fastställande av könstillhörighet i vissa fall
alternative label: Könsdysforiutredning
alternative label: Könsutredning
broader: Könsöverskridanden
broader: Hälso- och sjukvård (hbtqi)
hidden label: Könsidentitets-utredning
in scheme: Queerlit
related: Läkarutlåtanden
related: Könsbekräftande behandling
related: Transitionering
scope note: Används för skildringar av diagnostiserande utredning inom vården, med syfte att fastställa om en person ska tilldelas diagnosen könsdysfori/transsexualism och därmed ha rätt till könsbekräftande behandling.

Transgemenskaper
type: Concept
issued: 2022-05-19T10:12:00
modified: 2023-03-29T10:25:38
alternative label: Transcommunityt
broader: Könsöverskridanden
broader: Hbtqi-gemenskaper
hidden label: Trans-communityt
hidden label: Trans-gemenskaper
in scheme: Queerlit
related: Hbtqi+
related: Transpersoner
related: Hbtqi
scope note: Används för skildringar av sociala gemenskaper där huvudsakligen transpersoner interagerar.

Relationer mellan män
type: Concept
issued: 2022-10-26T08:10:16
modified: 2022-10-26T08:10:16
broader: Relationer (hbtqi)
in scheme: Queerlit
related: Bögrelationer
related: Queera relationer
related: Transrelationer
related: Bisexuella relationer
scope note: Används för skildringar av nära relationer mellan män, där deras sexuella läggning inte framgår. Kan omfatta aspekter som släktskap, vänskap, sex eller kärlek.

Underlivskirurgi (transpersoner)
type: Concept
issued: 2022-05-19T10:12:00
modified: 2023-03-29T10:53:01
alternative label: Falloplastik
alternative label: Femininiserande underlivskirurgi
alternative label: Könsbekräftande underlivskirurgi
alternative label: Maskuliniserande underlivskirurgi
alternative label: Metoidioplastik
broader: Könsbekräftande behandling
hidden label: Underlivs-kirurgi (transpersoner)
in scheme: Queerlit
narrower: Penektomi
narrower: Vaginoplastik
narrower: Orkidektomi
narrower: Hysterektomi
scope note: Används för skildringar av underlivsoperationer med könsbekräftande syfte.

Förnekande av sexuell läggning
type: Concept
issued: 2022-05-19T10:12:00
modified: 2022-05-19T10:12:00
in scheme: Queerlit
related: Självförtryck (hbtqi)
related: Latent homosexualitet
related: Sexuell läggning
scope note: Används för skildringar där personer förnekar, eller strävar efter att förneka, sin sexuella läggning.
top concept of: Queerlit

Homosexualitet
type: Concept
issued: 2022-05-19T10:12:00
modified: 2023-03-29T10:53:01
alternative label: Kvinnlig homosexualitet
alternative label: Lesbianism
alternative label: Manlig homosexualitet
broader: Sexuell läggning
hidden label: Homo-sexualitet
in scheme: Queerlit
narrower: Rituell homosexualitet
related: Homosexuella
related: Bisexualitet
related: Heterosexualitet
scope note: Används för skildringar av förmågan att huvudsakligen bli kär i och/eller attraherad av personer av samma kön som en själv.

Transpappor
type: Concept
issued: 2023-12-13T10:57:15
modified: 2023-12-13T10:57:15
alternative label: Transfäder
broader: Transmän
broader: Pappor
broader: Transföräldrar
hidden label: Trans-fäder
hidden label: Trans-pappor
in scheme: Queerlit
related: Transfamiljer
related: Barn till transpersoner
scope note: Används för skildringar av transmän som är pappor.

Mammor till transpersoner
type: Concept
issued: 2022-05-19T10:12:00
modified: 2023-12-13T10:57:15
alternative label: Mödrar till transpersoner
alternative label: Transpersoners mammor
alternative label: Transpersoners mödrar
broader: Föräldrar till transpersoner
broader: Mammor till hbtqi-personer
in scheme: Queerlit
narrower: Mammor till transmän
narrower: Mammor till transkvinnor
narrower: Mammor till ickebinära personer
scope note: Används för skildringar av mammor till transpersoner, oavsett mammans egen identitet.

Transvestism
type: Concept
issued: 2022-05-19T10:12:00
modified: 2022-11-16T11:33:32
alternative label: Transvestitism
broader: Könsuttryck
broader: Könsöverskridanden
in scheme: Queerlit
related: Crossdressing
related: Transvestiter
related: Eonism
scope note: Används för skildringar av transvestism. Transvestism innebär att någon klär sig som ett annat kön än det den identifierar sig som, att det är en del av personens identitet och att personen själv definierar sig som transvestit eller definieras så av andra.

Hbtqi-frigörelse
type: Concept
issued: 2022-05-19T10:12:00
modified: 2023-12-06T09:24:17
alternative label: Gay liberation movement
alternative label: Homosexuell frigörelse
broader: Sociala processer (hbtqi)
in scheme: Queerlit
related: Bögrörelser
related: Lesbiska rörelser
related: Hbtqi-rörelser
related: Stonewallupproret
scope note: Används för skildringar av de rörelser som från det sena 1960-talet arbetat för frigörelse och rättigheter för de grupper som kommit att kallas hbtqi-personer, ofta med ett bredare perspektiv på social rättvisa.

Föräldrar till bögar
type: Concept
issued: 2022-05-19T10:12:00
modified: 2022-05-19T10:12:00
alternative label: Bögars föräldrar
alternative label: Föräldrar till homosexuella män
broader: Föräldrar till homosexuella
in scheme: Queerlit
narrower: Mammor till bögar
narrower: Pappor till bögar
related: Bögar
related: Homosexuella pojkar
scope note: Används för skildringar av föräldrar till bögar, oavsett biologiskt släktskap.

Sexuell avhållsamhet
type: Concept
issued: 2022-05-19T10:12:00
modified: 2022-05-19T10:12:00
alternative label: Kyskhet
broader: Sex
in scheme: Queerlit
narrower: Oskuld
related: Asexualitet
related: Celibat
related: Sexualitet
scope note: Används för skildringar av att medvetet under längre perioder avstå från sexuella handlingar.

Föräldrar till queera personer
type: Concept
issued: 2022-05-19T10:12:00
modified: 2022-06-07T15:09:28
alternative label: Queera personers föräldrar
broader: Föräldrar till hbtqi-personer
in scheme: Queerlit
narrower: Mammor till queera personer
narrower: Pappor till queera personer
related: Queera barn
related: Queera personer
scope note: Används för skildringar av föräldrar till queera personer, oavsett biologiskt släktskap.

Föräldrar till transmän
type: Concept
issued: 2023-12-13T10:57:15
modified: 2023-12-13T10:57:15
alternative label: Föräldrar till transpojkar
alternative label: Transmäns föräldrar
alternative label: Transpojkars föräldrar
broader: Föräldrar till transpersoner
in scheme: Queerlit
narrower: Mammor till transmän
narrower: Pappor till transmän
related: Transmän
related: Transpojkar
scope note: Används för skildringar av föräldrar till transmän, oavsett biologiskt släktskap.

Föräldrar till bisexuella
type: Concept
issued: 2022-05-19T10:12:00
modified: 2022-06-07T15:09:28
alternative label: Bisexuellas föräldrar
broader: Föräldrar till hbtqi-personer
in scheme: Queerlit
narrower: Mammor till bisexuella
narrower: Pappor till bisexuella
related: Bisexuella
related: Bisexuella barn
scope note: Används för skildringar av föräldrar till bisexuella, oavsett biologiskt släktskap.

Prostitution
type: Concept
issued: 2022-05-19T10:12:00
modified: 2022-10-26T08:10:16
alternative label: Köpa sex
alternative label: Sex mot betalning
alternative label: Sex mot ersättning
alternative label: Sexhandel
alternative label: Sexköp
alternative label: Sälja sex
broader: Sexarbete
in scheme: Queerlit
narrower: Sugardejting
related: Bordeller
related: Sexturism
related: Sexköpare
scope note: Används för skildringar av köp av, eller erbjudanden om köp av, sexuella tjänster.

Separationer (hbtqi)
type: Concept
issued: 2022-05-19T10:12:00
modified: 2023-12-06T09:24:17
broader: Samlevnadsformer
in scheme: Queerlit
narrower: Skilsmässor (hbtqi)
related: Relationer (hbtqi)
related: Civilstånd
related: Före detta partners (hbtqi)
scope note: Används för skildringar av hbtqi-personer som genomgår en separation från en tidigare relation.

Unga transpersoner
type: Concept
issued: 2022-05-19T10:12:00
modified: 2024-09-05T13:44:36
alternative label: Transtonåringar
alternative label: Transungdomar
broader: Transpersoner
broader: Hbtqi-ungdomar
in scheme: Queerlit
narrower: Unga transmän
narrower: Unga ickebinära
narrower: Unga transkvinnor
scope note: Används för skildringar av ungdomar som beskrivs som trans.

Föräldrar till ickebinära personer
type: Concept
issued: 2022-05-19T10:12:00
modified: 2023-05-31T12:15:52
alternative label: Ickebinäras föräldrar
broader: Föräldrar till transpersoner
in scheme: Queerlit
narrower: Pappor till ickebinära personer
narrower: Mammor till ickebinära personer
related: Ickebinära barn
related: Ickebinära personer
scope note: Används för skildringar av föräldrar till ickebinära personer, oavsett biologiskt släktskap.

Barn till homosexuella
type: Concept
issued: 2022-05-19T10:12:00
modified: 2022-05-19T10:12:00
broader: Barn till hbtqi-personer
in scheme: Queerlit
narrower: Barn till bögar
narrower: Barn till lesbiska
related: Homosexuella föräldrar
related: Homosexuella familjer
scope note: Används för skildringar av barn till personer som beskrivs som homosexuella.

Penissex
type: Concept
issued: 2022-05-19T10:12:00
modified: 2022-05-19T10:12:00
broader: Sexuella praktiker
broader: Sex
in scheme: Queerlit
narrower: Samlag
narrower: Runka
narrower: Fellatio
scope note: Används för skildringar där penis stimuleras sexuellt eller används för att stimulera andra.

Arresteringar av hbtqi-personer
type: Concept
issued: 2022-05-19T10:12:00
modified: 2023-12-06T09:24:17
broader: Frihetsberövande av hbtqi-personer
in scheme: Queerlit
related: Civil olydnad (hbtqi)
related: Förföljelse av hbtqi-personer
related: Polisräder
related: Brottsprovokation
scope note: Används för skildringar av olika former av arresteringar av hbtqi-personer.

Erotisk massage
type: Concept
issued: 2022-05-19T10:12:00
modified: 2022-05-19T10:12:00
broader: Massage
broader: Sexuella praktiker
broader: Sex
in scheme: Queerlit
related: Sexarbetare (hbtqi)
related: Sex med händerna
scope note: Används för skildringar av massage med syfte att skapa sexuell njutning.

Brottsoffer (hbtqi)
type: Concept
issued: 2022-05-19T10:12:00
modified: 2023-12-06T09:24:17
alternative label: Hbtqi-personer som brottsoffer
broader: Hbtqi-personer
hidden label: Brotts-offer (hbtqi)
in scheme: Queerlit
narrower: Offer för sexuella övergrepp (hbtqi)
narrower: Hatbrottsoffer (hbtqi)
narrower: Våldtäktsoffer (hbtqi)
related: Utpressning (hbtqi)
scope note: Används för skildringar av hbtqi-personer som lidit fysisk, psykisk, känslomässig eller ekonomisk skada på grund av ett brott.

Ryktesspridning (hbtqi)
type: Concept
issued: 2022-05-19T10:12:00
modified: 2023-12-06T09:24:17
alternative label: Skvaller (hbtqi)
broader: Spekulationer (hbtqi)
in scheme: Queerlit
related: Diskretion (hbtqi)
related: Förtalskampanjer (hbtqi)
related: Outning
related: Utpressning (hbtqi)
scope note: Används för skildringar av att utan medgivande sprida information, riktig eller falsk, om någon annans sexuella läggning eller transitionserfarenhet.

Valda familjer (hbtqi)
type: Concept
issued: 2022-05-19T10:12:00
modified: 2023-12-06T09:24:17
broader: Hbtqi-familjer
in scheme: Queerlit
narrower: Dragfamiljer
narrower: Ballroomfamiljer
narrower: Läderfamiljer
related: Kollektiv (hbtqi)
scope note: Används för skildringar av grupper av personer som tar samma roll i en varandras liv som en idealbild av en biologisk familj, i form av stöd och gemenskap, och självdefinerar detta som en familjegrupp.

Föräldrar till transkvinnor
type: Concept
issued: 2023-12-13T10:57:15
modified: 2023-12-13T10:57:15
alternative label: Föräldrar till transflickor
alternative label: Transflickors föräldrar
alternative label: Transkvinnors föräldrar
broader: Föräldrar till transpersoner
in scheme: Queerlit
narrower: Pappor till transkvinnor
narrower: Mammor till transkvinnor
related: Transflickor
related: Transkvinnor
scope note: Används för skildringar av föräldrar till transkvinnor, oavsett biologiskt släktskap.

Homosexuella barn
type: Concept
issued: 2022-05-19T10:12:00
modified: 2022-06-07T15:09:28
broader: Homosexuella
broader: Hbtqi-barn
in scheme: Queerlit
narrower: Homosexuella pojkar
narrower: Lesbiska flickor
related: Föräldrar till homosexuella
scope note: Används för skildringar av barn som beskrivs som homosexuella.

Erotik
type: Concept
issued: 2022-05-19T10:12:00
modified: 2022-05-19T10:12:00
in scheme: Queerlit
related: Sexualitet
related: Kroppslig närhet
related: Sexuell upphetsning
scope note: Används för skildringar avsedda att framkalla sexuella känslor. Verk där denna aspekt är övervägande indexeras även med SAOGF-ämnesordet "Erotiska skildringar". Kan även användas för betraktelser över sexuellt begär och sensualism.
top concept of: Queerlit

Rollspel (sexualitet)
type: Concept
issued: 2022-05-19T10:12:00
modified: 2024-09-05T13:44:36
broader: Sex
in scheme: Queerlit
narrower: Ageplay
related: Sexuella roller
related: Sexuell identitet
related: Rollbeteende
scope note: Används för skildringar av sexuella lekar där deltagarna går in i olika roller för att öka den erotiska upplevelsen.

Pederasti
type: Concept
issued: 2022-05-19T10:12:00
modified: 2023-03-29T10:25:38
broader: Historiska termer (hbtqi)
in scheme: Queerlit
related: Sexuell preferens
related: Gossekärlek
related: Pederaster
related: Sodomi
scope note: Används för skildringar, historiska eller historiserande, som använder begreppet pederasti - ett äldre ord som oftast syftar på erotiska förhållanden mellan vuxna män och tonårspojkar.

Könseufori
type: Concept
issued: 2023-03-29T10:25:38
modified: 2023-03-29T10:25:38
alternative label: Kroppseufori
alternative label: Köns-eufori
broader: Könsöverskridanden
broader: Känslor (hbtqi)
in scheme: Queerlit
related: Transsexuella
related: Könsidentitet
related: Transpersoner
scope note: Används för skildringar av känslor av lycka och tillfredsställelse över ens upplevda/uttryckta kön, ofta relaterat till att detta bekräftas socialt eller i ens kropp. Begreppet används oftast relaterat till transpersoner.

Flyktingar (hbtqi)
type: Concept
issued: 2022-05-19T10:12:00
modified: 2023-12-06T09:24:17
alternative label: Hbtqi-flyktingar
broader: Migranter (hbtqi)
in scheme: Queerlit
related: Asylrätt (hbtqi)
related: Papperslösa hbtqi-personer
related: Förföljelse av hbtqi-personer
related: Rättsstatus
scope note: Används för skildringar av hbtqi-personer som är, eller har varit, på flykt från sitt hem på grund av krig, konflikt eller förföljelse.

Bisexuella barn
type: Concept
issued: 2022-05-19T10:12:00
modified: 2022-06-07T15:09:28
broader: Bisexuella
broader: Hbtqi-barn
in scheme: Queerlit
narrower: Bisexuella flickor
narrower: Bisexuella pojkar
related: Föräldrar till bisexuella
scope note: Används för skildringar av barn som beskrivs som bisexuella.

Homosexuella familjer
type: Concept
issued: 2022-05-19T10:12:00
modified: 2022-05-19T10:12:00
broader: Hbtqi-familjer
in scheme: Queerlit
narrower: Bögfamiljer
narrower: Lesbiska familjer
related: Homosexuella föräldrar
related: Barn till homosexuella
scope note: Används för skildringar av familjer bestående av vuxna homosexuella som lever med barn.

Relationer mellan kvinnor
type: Concept
issued: 2022-10-26T08:10:16
modified: 2022-10-26T08:10:16
broader: Relationer (hbtqi)
in scheme: Queerlit
related: Queera relationer
related: Transrelationer
related: Lesbiska relationer
related: Bisexuella relationer
scope note: Används för skildringar av nära relationer mellan kvinnor, där deras sexuella läggning inte framgår. Kan omfatta aspekter som släktskap, vänskap, sex eller kärlek.

Läkarutlåtanden
type: Concept
issued: 2022-05-19T10:12:00
modified: 2022-05-19T10:12:00
broader: Officiell dokumentation
in scheme: Queerlit
related: Könsidentitetsutredning
related: Hälso- och sjukvård
related: Transitionering
related: Körkort
scope note: Används för skildringar där omdömen baserade på läkarundersökning har betydelse för verket.

Dildoar
type: Concept
issued: 2022-05-19T10:12:00
modified: 2022-05-19T10:12:00
alternative label: Dildos
alternative label: Strap-ons
broader: Sexhjälpmedel
in scheme: Queerlit
related: Strap-onsex
related: Penisar
related: Vibratorer
related: Buttpluggar
scope note: Används för skildringar av penisattraper använda vid sex och/eller onani.

Genderbending
type: Concept
issued: 2022-05-19T10:12:00
modified: 2022-05-19T10:12:00
alternative label: Gender bending
alternative label: Gender blending
alternative label: Gender fuck
alternative label: Gender queer
alternative label: Genderblending
alternative label: Genderfuck
alternative label: Genderqueer
broader: Könsuttryck
broader: Könsöverskridanden
in scheme: Queerlit
related: Androgynitet
related: Kön
related: Könsroller
scope note: Används för skildringar av överskridande eller "böjning" av förväntade könsroller, att ta aspekter av två binära könsnormer och blanda i sitt uttryck och/eller att experimentera med nya, för könsnormen okonventionella uttryck.

Pansexuella
type: Concept
issued: 2022-05-19T10:12:00
modified: 2022-06-07T15:09:28
alternative label: Omnisexuella
broader: Hbtqi-personer
in scheme: Queerlit
related: Allosexualitet
related: Transsexuella
related: Bisexuella
related: Cispersoner
scope note: Används för skildringar av personer som beskrivs som pansexuella. Med pansexuell menas att personen känner emotionell/sexuell dragning till personer oberoende av biologiskt kön eller könsidentitet.

Homosexuella par
type: Concept
issued: 2022-05-19T10:12:00
modified: 2022-12-07T08:49:58
broader: Hbtqi-par
broader: Homosexuella
in scheme: Queerlit
narrower: Lesbiska par
narrower: Bögpar
related: Vänner (älskare)
scope note: Används för skildringar av parrelationer mellan homosexuella.

Könsförhållanden
type: Concept
issued: 2022-05-19T10:12:00
modified: 2022-05-19T10:12:00
broader: Sociala processer (hbtqi)
in scheme: Queerlit
narrower: Relationer mellan lesbiska och bögar
related: Kön
related: Hbtqi-separatism
related: Könsroller
scope note: Används för skildringar där hur personer av olika kön relaterar och interagerar med varandra beroende på deras könsidentitet har betydelse för verket.

Id-kort
type: Concept
issued: 2022-05-19T10:12:00
modified: 2022-05-19T10:12:00
alternative label: Identitetshandlingar
alternative label: Identitetskort
alternative label: Legitimationer
broader: Officiell dokumentation
in scheme: Queerlit
related: Namnändring
related: Pass
related: Transitionering
related: Körkort
scope note: Används för skildringar där officiella id-kort har betydelse för verket.

Gerontofili
type: Concept
issued: 2022-05-19T10:12:00
modified: 2023-01-11T08:39:46
broader: Sexuell preferens
broader: Fetischism (sexualitet)
in scheme: Queerlit
related: Äldre
related: Äldre hbtqi-personer
related: Intergenerationella relationer
scope note: Används för skildringar av sexuell dragning till åldrade människor.

Straffrätt
type: Concept
issued: 2022-05-19T10:12:00
modified: 2022-05-19T10:12:00
broader: Juridik
in scheme: Queerlit
narrower: Sexualbrottslagstiftning
narrower: Kriminalisering
narrower: Avkriminalisering
related: Utpressning (hbtqi)
scope note: Används för skildringar där den del av juridiken som avhandlar brott och deras påföljder har en framträdande betydelse för verket.

Transmammor
type: Concept
issued: 2023-12-13T10:57:15
modified: 2023-12-13T10:57:15
alternative label: Transmödrar
broader: Transföräldrar
broader: Transkvinnor
broader: Mammor
hidden label: Trans-mammor
hidden label: Trans-mödrar
in scheme: Queerlit
related: Transfamiljer
related: Barn till transpersoner
scope note: Används för skildringar av transkvinnor som är mammor.

Droganvändning (hbtqi)
type: Concept
issued: 2022-05-19T10:12:00
modified: 2023-12-06T09:24:17
alternative label: Droganvändning hos hbtqi-personer
alternative label: Hbtqi-personer som använder droger
alternative label: Hbtqi-personer som knarkar
in scheme: Queerlit
narrower: Kemsex
related: Drogmissbruk (hbtqi)
related: Poppers
scope note: Används för skildringar där hbtqi-personer använder droger men ej lever i missbruk eller beroende.
top concept of: Queerlit

Fellatio
type: Concept
issued: 2022-05-19T10:12:00
modified: 2022-05-19T10:12:00
alternative label: Avsugning
alternative label: Fransk massage
alternative label: Suga kuk
broader: Oralsex
broader: Penissex
broader: Sexuella praktiker
broader: Sex
in scheme: Queerlit
related: Penisar
scope note: Används för skildringar av den sexuella akt där en person stimulerar någon annans penis med mun och tunga.

Föräldrar till lesbiska
type: Concept
issued: 2022-05-19T10:12:00
modified: 2022-05-19T10:12:00
alternative label: Föräldrar till homosexuella kvinnor
alternative label: Lesbiskas föräldrar
broader: Föräldrar till homosexuella
in scheme: Queerlit
narrower: Mammor till lesbiska
narrower: Pappor till lesbiska
related: Lesbiska
related: Lesbiska flickor
scope note: Används för skildringar av föräldrar till lesbiska, oavsett biologiskt släktskap.

Frottage
type: Concept
issued: 2022-05-19T10:12:00
modified: 2022-05-19T10:12:00
alternative label: Gnidsex
alternative label: Saxa
alternative label: Tribadism
broader: Sexuella praktiker
broader: Historiska termer (hbtqi)
broader: Sex
in scheme: Queerlit
related: Tribader
related: Sex
scope note: Används för skildringar av sexuell aktivitet som innebär att gnida kön mot annan persons kön eller mot annan kroppsdel.

Sexfester
type: Concept
issued: 2022-05-19T10:12:00
modified: 2023-03-29T10:53:01
alternative label: Sexpartyn
broader: Sexställen
hidden label: Sex-fester
hidden label: Sex-partyn
in scheme: Queerlit
related: Gruppsex
related: Sexualitet
related: Sexklubbar
related: Dark rooms
scope note: Används för skildringar av fester där människor har möjlighet att och förväntas utföra sexuella aktiviteter.

Pappor till transpersoner
type: Concept
issued: 2022-05-19T10:12:00
modified: 2023-12-13T10:57:15
alternative label: Fäder till transpersoner
alternative label: Transpersoners fäder
alternative label: Transpersoners pappor
broader: Pappor till hbtqi-personer
broader: Föräldrar till transpersoner
in scheme: Queerlit
narrower: Pappor till transmän
narrower: Pappor till ickebinära personer
narrower: Pappor till transkvinnor
scope note: Används för skildringar av pappor till transpersoner, oavsett pappans egen identitet.

Föräldrar till intersexpersoner
type: Concept
issued: 2022-05-19T10:12:00
modified: 2024-03-19T10:00:33
alternative label: Intersexpersoners föräldrar
broader: Föräldrar till hbtqi-personer
in scheme: Queerlit
narrower: Mammor till intersexpersoner
narrower: Pappor till intersexpersoner
related: Intersexpersoner
related: Intersexbarn
scope note: Används för skildringar av föräldrar till intersexpersoner, oavsett biologiskt släktskap.

Lesbiska studier
type: Concept
issued: 2022-05-19T10:12:00
modified: 2022-05-19T10:12:00
alternative label: Lesbisk forskning
broader: Homosexualitetsstudier
in scheme: Queerlit
related: Bisexualitetsstudier
related: Transstudier
related: Queerstudier
related: Bögstudier
scope note: Används för skildringar av det vetenskapliga fält som fokuserar på studier av lesbiska identiteter, sammanhang, livsvillkor och erfarenheter.

Dragbaler
type: Concept
issued: 2022-05-19T10:12:00
modified: 2023-03-29T10:53:01
alternative label: Dragfester
broader: Könsöverskridanden
broader: Hbtqi-evenemang
hidden label: Drag-baler
hidden label: Drag-fester
in scheme: Queerlit
related: Ballroomkultur
related: Draggemenskaper
related: Dragartister
scope note: Används för skildringar av fester under första halvan av 1900-talet där samkönade danspartners och crossdressing var accepterat samt för skildringar av fester med draguppträdanden och voguing i modern tid.

Fjollor
type: Concept
issued: 2022-05-19T10:12:00
modified: 2022-11-16T11:33:32
broader: Skällsord
broader: Återvunna termer
broader: Historiska termer (hbtqi)
in scheme: Queerlit
related: Bögar
related: Såna (hbtqi)
scope note: Används för skildringar där begreppet "fjollor" fungerar som nedlåtande beskrivning av feminina män som antas (men inte behöver) vara bögar. Kan även användas för skildringar där begreppet återvunnits och uppvärderats som självidentifierande.

Trans march
type: Concept
issued: 2022-05-19T10:12:00
modified: 2022-05-19T10:12:00
alternative label: Trans marcher
alternative label: Trans marsch
alternative label: Trans marscher
alternative label: Trans parader
alternative label: Trans-march
alternative label: Trans-marcher
alternative label: Trans-marsch
alternative label: Trans-marscher
alternative label: Trans-parader
alternative label: Transmarch
alternative label: Transmarcher
alternative label: Transmarsch
alternative label: Transmarscher
alternative label: Transparader
broader: Könsöverskridanden
broader: Hbtqi-evenemang
in scheme: Queerlit
related: Transrörelser
related: Dyke march
related: Pride
scope note: Används för skildringar av marscher, parader och liknande med uttalat fokus på transpersoners rättigheter och levnadsvillkor.

Voyeurism
type: Concept
issued: 2022-05-19T10:12:00
modified: 2022-05-19T10:12:00
alternative label: Skopofili
alternative label: Skoptofili
broader: Sexuell preferens
broader: Fetischism (sexualitet)
broader: Sexuella praktiker
broader: Sex
in scheme: Queerlit
related: Exhibitionism
scope note: Används för skildringar av personer som finner sexuell upphetsning i att betrakta andra människor nakna eller i sexuella sammanhang, både med och utan samtycke.

Bögstudier
type: Concept
issued: 2022-05-19T10:12:00
modified: 2022-05-19T10:12:00
broader: Homosexualitetsstudier
hidden label: Bög-studier
in scheme: Queerlit
related: Bisexualitetsstudier
related: Transstudier
related: Lesbiska studier
related: Queerstudier
scope note: Används för skildringar av det vetenskapliga fält som fokuserar på studier av bögars identiteter, sammanhang, livsvillkor och erfarenheter.

Homosexuella pojkar
type: Concept
issued: 2022-05-19T10:12:00
modified: 2023-02-07T17:15:49
broader: Bögar
broader: Homosexuella barn
broader: Pojkar
in scheme: Queerlit
related: Föräldrar till bögar
related: Kärlek mellan pojkar
scope note: Används för skildringar av pojkar som beskrivs som homosexuella.

Vaginor
type: Concept
issued: 2022-05-19T10:12:00
modified: 2024-09-05T13:44:36
alternative label: Slidor
broader: Könsorgan
broader: Erogena zoner
in scheme: Queerlit
narrower: Neovaginor
narrower: G-punkten
related: Vulvasmärtor
scope note: Används för skildringar av de inre delarna av fittan, oftast synonymt med slidan.

Pride
type: Concept
issued: 2022-05-19T10:12:00
modified: 2023-12-06T09:24:17
alternative label: Europride
alternative label: Pride-arrangemang
alternative label: Pridefestivaler
alternative label: Sydney Gay and Lesbian Mardi Gras
alternative label: Worldpride
broader: Hbtqi-evenemang
in scheme: Queerlit
related: Hbtqi-rörelser
related: Dyke march
related: Demonstrationer (hbtqi)
related: Trans march
scope note: Används för skildringar av Pridefestivaler och Prideparader, vilka bland annat syftar till att öka synligheten för hbtqi-personer.

Lesbiska flickor
type: Concept
issued: 2022-05-19T10:12:00
modified: 2023-02-07T17:15:49
broader: Lesbiska
broader: Flickor
broader: Homosexuella barn
in scheme: Queerlit
related: Kärlek mellan flickor
related: Föräldrar till lesbiska
scope note: Används för skildringar av flickor som beskrivs som lesbiska.

Heterosexualitet
type: Concept
issued: 2022-05-19T10:12:00
modified: 2022-05-19T10:12:00
broader: Sexuell läggning
hidden label: Hetero-sexualitet
in scheme: Queerlit
related: Homosexualitet
related: Heterosexuella
related: Heterosexism
related: Bisexualitet
scope note: Används för skildringar av förmågan att huvudsakligen bli kär i och/eller attraherad av personer av motsatt kön som en själv. Ämnesordet används för skildringar där heterosexualiteten är i fokus.

Kläder
type: Concept
issued: 2022-05-19T10:12:00
modified: 2022-05-19T10:12:00
in scheme: Queerlit
narrower: Underkläder
related: Könsuttryck
related: Crossdressing
related: Dragartister
scope note: Används för skildringar där kläder har betydelse för verket.
top concept of: Queerlit

Bisexualitetsstudier
type: Concept
issued: 2022-05-19T10:12:00
modified: 2023-03-29T10:25:38
alternative label: Bisexualitetsforskning
broader: Genusvetenskap
hidden label: Bisexualitets-forskning
hidden label: Bisexualitets-studier
in scheme: Queerlit
related: Transstudier
related: Homosexualitetsstudier
related: Lesbiska studier
related: Queerstudier
related: Bögstudier
scope note: Används för skildringar av det vetenskapliga fält som fokuserar på studier av bisexuella identiteter, sammanhang, livsvillkor och erfarenheter.

Samboavtal
type: Concept
issued: 2022-05-19T10:12:00
modified: 2022-05-19T10:12:00
broader: Officiell dokumentation
hidden label: Sambo-avtal
in scheme: Queerlit
related: Samlevnadsformer
related: Samboförhållanden
related: Familjerätt (hbtqi)
related: Bröllop (hbtqi)
related: Äktenskap
scope note: Används för skildringar där skriftliga avtal mellan två personer som väljer att leva och bo tillsammans, utan att vara gifta, har betydelse för verket.

Asylrätt (hbtqi)
type: Concept
issued: 2022-05-19T10:12:00
modified: 2023-12-06T09:24:17
broader: Rättsstatus
in scheme: Queerlit
related: Papperslösa hbtqi-personer
related: Pass
related: Frihetsberövande av hbtqi-personer
related: Officiell dokumentation
related: Flyktingar (hbtqi)
scope note: Används för skildringar av hur hbtqi-personer använder sig av och blir påverkade av asylrätten.

Efebofili
type: Concept
issued: 2022-05-19T10:12:00
modified: 2023-03-29T10:25:38
broader: Sexuell preferens
broader: Fetischism (sexualitet)
in scheme: Queerlit
related: Gossekärlek
related: Intergenerationella relationer
related: Ungdomar
related: Hbtqi-ungdomar
scope note: Används för skildringar av vuxna personers sexuella preferens för unga (16-20 år) postpubertala män.

Asexualitet
type: Concept
issued: 2022-05-19T10:12:00
modified: 2024-09-05T13:44:36
alternative label: Ace
broader: Sexuell läggning
in scheme: Queerlit
related: Hbtqi+
related: Sexuell avhållsamhet
related: Oskuld
related: Demisexualitet
related: Asexuella
scope note: Används för skildringar av att varaktigt inte känna sexuell attraktion eller lust.

Personer som lever med hiv
type: Concept
issued: 2022-05-19T10:12:00
modified: 2022-05-19T10:12:00
alternative label: Hiv-positiva
in scheme: Queerlit
narrower: Personer som lever med välbehandlad hiv
related: Par med olika hivstatus
related: Hiv/aids
related: Kompisvård (hbtqi)
scope note: Används för skildringar av personer som diagnostiserats som infekterade av humant immunbristvirus (hiv).
top concept of: Queerlit

Sociala medier
type: Concept
issued: 2022-05-19T10:12:00
modified: 2022-05-19T10:12:00
alternative label: Användargenererad media
alternative label: Sociala media
in scheme: Queerlit
narrower: Dejtingappar
narrower: Dejtingsidor
narrower: Internetforum
narrower: Bloggar
scope note: Används för skildringar av webbplatser och mobila appar med användargenererat innehåll och möjlighet att interagera i sociala nätverk.
top concept of: Queerlit

Bögrelationer
type: Concept
issued: 2022-05-19T10:12:00
modified: 2022-10-26T08:10:16
broader: Homosexuella relationer
hidden label: Bög-relationer
in scheme: Queerlit
related: Relationer mellan män
related: Queera relationer
related: Transrelationer
related: Bisexuella relationer
related: Intersexrelationer
scope note: Används för skildringar av nära relationer mellan bögar. Kan omfatta aspekter som släktskap, vänskap, sex eller kärlek.

Polistrakasserier
type: Concept
issued: 2022-05-19T10:12:00
modified: 2022-05-19T10:12:00
broader: Trakasserier
hidden label: Polis-trakasserier
in scheme: Queerlit
narrower: Polisräder
narrower: Brottsprovokation
related: Förföljelse av hbtqi-personer
related: Diskriminering av hbtqi-personer
related: Stonewallupproret
scope note: Används för skildringar av medvetet vållande av obehag, förföljelser eller hot från polisens sida.

Våld i nära relationer (hbtqi)
type: Concept
issued: 2022-05-19T10:12:00
modified: 2023-12-06T09:24:17
alternative label: Närståendevåld
alternative label: Partnervåld
alternative label: Våld i familjen
alternative label: Våld i hemmet
broader: Våld mot hbtqi-personer
broader: Sexuellt våld
in scheme: Queerlit
related: Sexuella övergrepp (hbtqi)
related: Partners (hbtqi)
related: Offer för sexuella övergrepp (hbtqi)
related: Sexuellt samtycke
scope note: Används för skildringar av alla typer av våld - fysiskt och psykiskt - som riktas mot närstående, t.ex. i partner-, syskon- eller andra familjerelationer.

Könsdysfori
type: Concept
issued: 2022-05-19T10:12:00
modified: 2024-09-05T13:44:36
alternative label: Dysfori (kön)
alternative label: GID
broader: Könsöverskridanden
broader: Medikalisering
in scheme: Queerlit
related: Transsexuella
related: Transsexualism
related: Könsidentitet
related: Transpersoner
scope note: Används för skildringar av känslan att ens upplevda/uttryckta kön inte överensstämmer med ens tilldelade kön. Begreppet är en klinisk diagnos, men kan även användas för skildringar av självförståelse som uttrycks med begreppet.

Äldre
type: Concept
issued: 2022-05-19T10:12:00
modified: 2022-05-19T10:12:00
alternative label: Gamla personer
alternative label: Seniorer
in scheme: Queerlit
narrower: Äldre hbtqi-personer
narrower: Äldre heterosexuella
narrower: Okönade äldre
related: Gerontofili
scope note: Används för skildringar av personer som beskrivs som äldre - i regel över 65 år.
top concept of: Queerlit

Sexuell omvändelse
type: Concept
issued: 2022-05-19T10:12:00
modified: 2024-09-05T13:44:36
alternative label: Konversionsterapi
alternative label: Omvandlingsterapi
alternative label: Omvändelseterapi
alternative label: Sexuell omorientering
alternative label: Sexuell reorientering
broader: Terapier och behandlingar
in scheme: Queerlit
related: Sexuell preferens
related: Missnöje med egen sexuell läggning
related: Ex-gayrörelser
related: Aversionsterapi (hbtqi)
related: Sexuell läggning
scope note: Används för skildringar av försök att omvända någons sexuella läggning, vanligtvis från homosexuell till heterosexuell.

Onani
type: Concept
issued: 2022-05-19T10:12:00
modified: 2022-05-19T10:12:00
alternative label: Masturbation
alternative label: Masturbering
alternative label: Självbefläckelse
broader: Sexuella praktiker
broader: Sex
in scheme: Queerlit
narrower: Runka
narrower: Gemensam onani
narrower: Klittra
related: Sex med händerna
scope note: Används för skildringar av självstimulering av det egna könsorganet för sexuell upphetsning och tillfredsställelse.

Transfamiljer
type: Concept
issued: 2022-05-19T10:12:00
modified: 2023-12-13T10:57:15
broader: Könsöverskridanden
broader: Hbtqi-familjer
hidden label: Trans-familjer
in scheme: Queerlit
related: Transpappor
related: Transföräldrar
related: Transmammor
related: Barn till transpersoner
scope note: Används för skildringar av familjer bestående av vuxna transpersoner som lever med barn.

Samlag
type: Concept
issued: 2022-05-19T10:12:00
modified: 2022-05-19T10:12:00
alternative label: Knulla
broader: Strap-onsex
broader: Penissex
broader: Sexuella praktiker
broader: Sex
in scheme: Queerlit
narrower: Anala samlag
narrower: Vaginala samlag
scope note: Används för skildringar där två eller flera personer har könsumgänge.

Homosexuella föräldrar
type: Concept
issued: 2022-05-19T10:12:00
modified: 2022-06-07T15:09:28
broader: Föräldrar (hbtqi)
broader: Homosexuella
in scheme: Queerlit
narrower: Bögföräldrar
narrower: Lesbiska föräldrar
related: Barn till homosexuella
related: Homosexuella familjer
scope note: Används för skildringar av homosexuella som, ensamma eller tillsammans med andra, är föräldrar.

Lesbisk kultur
type: Concept
issued: 2022-05-19T10:12:00
modified: 2022-05-19T10:12:00
alternative label: Flatkultur
broader: Subkulturer
in scheme: Queerlit
narrower: Lesbiska körer
narrower: Butch-femme relationer
narrower: Dykes on bikes
narrower: Kvinnomusik
related: Sexuell identitet
scope note: Används för skildringar av kulturer eller uttryck präglade av lesbiskas interaktion eller deltagande.

Pass
type: Concept
issued: 2022-05-19T10:12:00
modified: 2022-05-19T10:12:00
broader: Officiell dokumentation
in scheme: Queerlit
related: Juridiskt namn
related: Asylrätt (hbtqi)
related: Namnändring
related: Id-kort
related: Transitionering
scope note: Används för skildringar där identitetshandlingar utfärdade av en statlig myndighet, ofta använda för resor över nationsgränser, har betydelse för verket

Switchar (BDSM)
type: Concept
issued: 2022-05-19T10:12:00
modified: 2022-05-19T10:12:00
broader: Sexuella roller
broader: Sexuell identitet
in scheme: Queerlit
related: Dominanta (hbtqi)
related: BDSM-gemenskaper
related: BDSM
related: Undergivna (hbtqi)
scope note: Används för skildringar av personer som i BDSM-lekar eller sex varierar mellan givande och mottagande eller dominanta och undergivna roller.

Ballroomkultur
type: Concept
issued: 2022-05-19T10:12:00
modified: 2023-03-29T10:53:01
alternative label: Ballroom culture
alternative label: Ballroom-community
broader: Subkulturer
hidden label: Ballroom-kultur
in scheme: Queerlit
narrower: Ballroomfamiljer
narrower: Voguing
related: Sexuell identitet
related: Draggemenskaper
related: Dragbaler
scope note: Används för skildringar av subkulturen ballroom som uppstod i New York på 1970-talet och som kretsar kring tävlingar i t.ex. dans (främst voguing) och drag.

Nyutkomna lesbiska
type: Concept
issued: 2022-05-19T10:12:00
modified: 2022-06-07T15:09:28
broader: Lesbiska
in scheme: Queerlit
related: Outning
related: Nyutkomna bögar
related: Nyutkomna bisexuella
related: Komma ut
related: Queera nyutkomna
scope note: Används för skildringar av personer som nyligen berättat för andra om, eller på annat sätt offentliggjort, att de är lesbiska.

Återvunna termer
type: Concept
issued: 2022-05-19T10:12:00
modified: 2022-05-19T10:12:00
alternative label: Återvunna begrepp
alternative label: Återvunna ord
broader: Hbtqi-slang
in scheme: Queerlit
narrower: Flator
narrower: Fjollor
related: Skällsord
related: Bögar
related: Queera personer
scope note: Används för skildringar av termer som tidigare använts nedsättande men som återtagits och uppvärderats av den grupp som termen riktats mot.

Gruppsex
type: Concept
issued: 2022-05-19T10:12:00
modified: 2023-05-10T08:32:00
alternative label: Orgier
alternative label: Trekanter
broader: Sexuella praktiker
hidden label: Grupp-sex
in scheme: Queerlit
related: Polyamori
related: Sexualitet
related: Tillfälligt sex
related: Sexfester
related: Flersamma relationer
scope note: Används för skildringar av sexuella aktiviteter med fler än två deltagare.

Nyutkomna bögar
type: Concept
issued: 2022-05-19T10:12:00
modified: 2022-06-07T15:09:28
broader: Bögar
in scheme: Queerlit
related: Outning
related: Nyutkomna lesbiska
related: Nyutkomna bisexuella
related: Komma ut
related: Queera nyutkomna
scope note: Används för skildringar av personer som nyligen berättat för andra om, eller på annat sätt offentliggjort, att de är bögar.

Transföräldrar
type: Concept
issued: 2022-05-19T10:12:00
modified: 2024-09-05T13:44:36
broader: Föräldrar (hbtqi)
broader: Transpersoner
hidden label: Trans-föräldrar
in scheme: Queerlit
narrower: Transpappor
narrower: Transmammor
related: Transfamiljer
related: Barn till transpersoner
scope note: Används för skildringar av transpersoner som är föräldrar.

Ensamstående föräldrar (hbtqi)
type: Concept
issued: 2022-05-19T10:12:00
modified: 2023-12-06T09:24:17
broader: Föräldrar (hbtqi)
broader: Hbtqi-personer
broader: Singlar
broader: Familjer med ensamstående föräldrar (hbtqi)
in scheme: Queerlit
narrower: Ensamstående pappor (hbtqi)
narrower: Ensamstående mammor (hbtqi)
scope note: Används för skildringar av föräldrar som är hbtqi-personer och som lever ensamma med barn och har ensam eller delad vårdnad där barnen bor hos föräldern på minst halvtid.

Nyutkomna bisexuella
type: Concept
issued: 2022-05-19T10:12:00
modified: 2022-06-07T15:09:28
broader: Bisexuella
in scheme: Queerlit
related: Outning
related: Nyutkomna lesbiska
related: Nyutkomna bögar
related: Komma ut
related: Queera nyutkomna
scope note: Används för skildringar av personer som nyligen berättat för andra om, eller på annat sätt offentliggjort, att de är bisexuella.

Homofobi
type: Concept
issued: 2022-05-19T10:12:00
modified: 2022-05-19T10:12:00
broader: Hbtqi-fobi
hidden label: Homo-fobi
in scheme: Queerlit
narrower: Lesbofobi
related: Våld mot hbtqi-personer
related: Homosexuella
related: Heterosexism
related: Diskriminering av hbtqi-personer
scope note: Används för skildringar av rädsla, avsky eller hat gentemot homosexuella eller de som antas vara homosexuella.

Bögföräldrar
type: Concept
issued: 2022-05-19T10:12:00
modified: 2023-03-29T10:53:01
alternative label: Bögfarsor
alternative label: Bögfäder
alternative label: Bögpappor
alternative label: Homosexuella farsor
alternative label: Homosexuella fäder
alternative label: Homosexuella pappor
broader: Pappor
broader: Homosexuella föräldrar
broader: Bögar
hidden label: Bög-föräldrar
in scheme: Queerlit
related: Barn till bögar
related: Två pappor
related: Bögfamiljer
scope note: Används för skildringar av bögar som, ensamma eller tillsammans med andra, är föräldrar. För skildringar av två bögföräldrar med gemensamma barn, använd även ämnesordet "Två pappor".

Frihetsberövande av hbtqi-personer
type: Concept
issued: 2022-05-19T10:12:00
modified: 2023-12-06T09:24:17
alternative label: Fängslande av hbtqi-personer
alternative label: Förvar av hbtqi-personer
alternative label: Häktning av hbtqi-personer
alternative label: Internering av hbtqi-personer
broader: Rättsstatus
in scheme: Queerlit
narrower: Fängelsestraff (hbtqi)
narrower: Arresteringar av hbtqi-personer
narrower: Tvångsvård av hbtqi-personer
related: Asylrätt (hbtqi)
related: Fångar (hbtqi)
scope note: Används för skildringar där hbtqi-personer genom inspärrning eller övervakning enbart kan befinna sig inom ett starkt begränsat område.

Butch-femme relationer
type: Concept
issued: 2022-05-19T10:12:00
modified: 2022-05-19T10:12:00
broader: Lesbisk kultur
broader: Relationer (hbtqi)
in scheme: Queerlit
related: Sexuell identitet
related: Rollbeteende
related: Femmes
related: Butchar
scope note: Används för skildringar av relationer mellan butchar och femmes.

Sexuellt våld
type: Concept
issued: 2022-05-19T10:12:00
modified: 2022-05-19T10:12:00
in scheme: Queerlit
narrower: Sexuella övergrepp (hbtqi)
narrower: Våld i nära relationer (hbtqi)
narrower: Våldtäktsoffer (hbtqi)
related: Våld mot hbtqi-personer
scope note: Används för skildringar av kränkningar och övergrepp med sexuell karaktär.
top concept of: Queerlit

Intergenerationella relationer
type: Concept
issued: 2022-05-19T10:12:00
modified: 2022-09-13T11:17:51
alternative label: Förhållanden över generationsgränser
alternative label: Intergenerationella förhållanden
alternative label: Relationer med åldersskillnad
alternative label: Relationer över generationsgränser
broader: Relationer (hbtqi)
in scheme: Queerlit
related: Efebofili
related: Relationspreferens
related: Sexuell identitet
related: Sexuell myndighetsålder
related: Gerontofili
scope note: Används för skildringar av sexuella relationer och kärleksrelationer mellan personer från olika generationer.

Homosexualitetsstudier
type: Concept
issued: 2022-05-19T10:12:00
modified: 2022-05-19T10:12:00
broader: Genusvetenskap
hidden label: Homosexualitets-studier
in scheme: Queerlit
narrower: Lesbiska studier
narrower: Bögstudier
related: Bisexualitetsstudier
related: Transstudier
related: Queerstudier
scope note: Används för skildringar av det vetenskapliga fält som fokuserar på studier av homosexuella identiteter, sammanhang, livsvillkor och erfarenheter.

Asiatiska religioner (hbtqi)
type: Concept
issued: 2022-05-19T10:12:00
modified: 2023-12-06T09:24:17
broader: Religion (hbtqi)
in scheme: Queerlit
narrower: Buddism (hbtqi)
narrower: Shintoism (hbtqi)
narrower: Taoism (hbtqi)
narrower: Konfucianism (hbtqi)
narrower: Hinduism (hbtqi)
scope note: Används för skildringar av hbtqi-personer som är anhängare av religioner med ursprung i Asien (förutom islam och kristendom - se "Islam (hbtqi)" respektive "Kristendom (hbtqi)" för dessa). Används även för skildringar av hbtqi-personers förhållningssätt till asiatiska religioner eller hur andra anhängare av dessa religioner förhåller sig till hbtqi.

Sodomi
type: Concept
issued: 2022-05-19T10:12:00
modified: 2022-05-19T10:12:00
broader: Historiska termer (hbtqi)
in scheme: Queerlit
related: Sodomiter
related: Sexuella praktiker
related: Antigaylagar
related: Pederasti
related: Sex
scope note: Används för skildringar, historiska eller historiserande, som använder begreppet sodomi - ett från Bibeln hämtat ord för oönskade eller "onaturliga" sexuella beteenden som inte syftar till önskad fortplantning. Bland annat har analsex räknats som sodomi, och begreppet har ofta använts om män som har sex med män.

Utpressning (hbtqi)
type: Concept
issued: 2022-05-19T10:12:00
modified: 2023-12-06T09:24:17
in scheme: Queerlit
related: Outning
related: Brottsoffer (hbtqi)
related: Ryktesspridning (hbtqi)
related: Straffrätt
scope note: Används för skildringar av att med hot (t.ex. om att avslöja någons sexuella läggning eller transitionshistoria) tvinga någon till något, t.ex. att betala pengar till utpressaren.
top concept of: Queerlit

Kristendom (hbtqi)
type: Concept
issued: 2022-05-19T10:12:00
modified: 2023-12-06T09:24:17
alternative label: Kristna (hbtqi)
broader: Religion (hbtqi)
in scheme: Queerlit
narrower: Mormonism (hbtqi)
narrower: Jehovas vittnen (hbtqi)
narrower: Katolicism (hbtqi)
narrower: Protestantism (hbtqi)
narrower: Ortodox kristendom (hbtqi)
scope note: Används för skildringar av hbtqi-personer som är kristna. Används även för skildringar av hbtqi-personers förhållningssätt till kristendom eller andra kristnas förhållningssätt till hbtqi.

Cunnilingus
type: Concept
issued: 2022-05-19T10:12:00
modified: 2022-05-19T10:12:00
alternative label: Slicka fitta
broader: Oralsex
broader: Vaginalsex
broader: Slicksex
broader: Sexuella praktiker
broader: Sex
broader: Klitorissex
in scheme: Queerlit
scope note: Används för skildringar av sexuell stimulans av vulvan med mun och tunga.

Lesbiska föräldrar
type: Concept
issued: 2022-05-19T10:12:00
modified: 2022-06-22T14:37:20
alternative label: Homosexuella mammor
alternative label: Homosexuella mödrar
alternative label: Lesbiska mammor
alternative label: Lesbiska mödrar
broader: Homosexuella föräldrar
broader: Lesbiska
broader: Mammor
in scheme: Queerlit
related: Två mammor
related: Barn till lesbiska
related: Lesbiska familjer
scope note: Används för skildringar av lesbiska som, ensamma eller tillsammans med andra, är föräldrar. För skildringar av två lesbiska föräldrar med gemensamma barn, använd även ämnesordet "Två mammor".

Sexuell inversion
type: Concept
issued: 2022-05-19T10:12:00
modified: 2022-05-19T10:12:00
broader: Medikalisering
broader: Historiska termer (hbtqi)
in scheme: Queerlit
related: Uranism
related: Sexuell preferens
related: Inverterade
related: Eonism
scope note: Används för skildringar, historiska eller historiserande, som använder begreppet sexuell inversion- en historisk term för homosexualitet använd bland sexologer för att referera till en medfödd omkastning av könskarakteristiska drag eller roller.

Icke-vita hbtqi-personer
type: Concept
issued: 2022-05-19T10:12:00
modified: 2023-12-06T09:24:17
alternative label: Färgade hbtqi-personer
alternative label: Hbtqi POC
alternative label: Hbtqi people of color
alternative label: Hbtqi people of colour
alternative label: Ickevita hbtqi-personer
alternative label: Rasifierade hbtqi-personer
broader: Etniska grupper (hbtqi)
in scheme: Queerlit
narrower: Asiater (hbtqi)
narrower: Ursprungsbefolkningar (hbtqi)
narrower: Latines (hbtqi)
narrower: Svarta hbtqi-personer
related: Ballroomfamiljer
scope note: Används för skildringar av homosexuella, bisexuella, transpersoner, queera och/eller intersexpersoner som beskrivs som icke-vita. Icke-vit förstås här som en rasifierande kategori som markerar personer med melaninrik hud eller andra karakteristika som rasifieras som icke-vita. Ämnesordet används för skildringar där identiteten som icke-vit är i fokus.

Megasexualitet
type: Concept
issued: 2022-05-19T10:12:00
modified: 2022-05-19T10:12:00
broader: Sexuell identitet
broader: Sexuell läggning
hidden label: Mega-sexualitet
in scheme: Queerlit
related: Demisexualitet
related: Känslor (hbtqi)
related: Sexuella relationer
related: Megasexuella
scope note: Används för skildringar av en sexuell läggning som i allmänhet kännetecknas av brist på romantisk känslomässig koppling till en annan person om inte, eller tills, en stark sexuell koppling till personen bildats.

Transbarn
type: Concept
issued: 2022-05-19T10:12:00
modified: 2024-09-05T13:44:36
broader: Hbtqi-barn
broader: Transpersoner
hidden label: Trans-barn
in scheme: Queerlit
narrower: Transpojkar
narrower: Ickebinära barn
narrower: Transflickor
related: Föräldrar till transpersoner
scope note: Används för skildringar av barn som beskrivs som transpersoner.

Bisexuella föräldrar
type: Concept
issued: 2022-05-19T10:12:00
modified: 2022-06-07T15:09:28
broader: Föräldrar (hbtqi)
broader: Bisexuella
in scheme: Queerlit
related: Två pappor
related: Två mammor
related: Barn till bisexuella
related: Bisexuella familjer
scope note: Används för skildringar av bisexuella som, ensamma eller tillsammans med andra, är föräldrar. För skildringar av två bisexuella mammor/pappor med gemensamma barn, använd även ämnesordet "Två mammor" eller "Två pappor".

Våldtäktsoffer (hbtqi)
type: Concept
issued: 2022-05-19T10:12:00
modified: 2023-12-06T09:24:17
alternative label: Hbtqi-personer som våldtäktsoffer
alternative label: Hbtqi-personer utsatta för våldtäkt
broader: Offer för sexuella övergrepp (hbtqi)
broader: Sexuellt våld
broader: Brottsoffer (hbtqi)
hidden label: Våldtäkts-offer (hbtqi)
in scheme: Queerlit
related: Våld mot hbtqi-personer
related: Barn utsatta för sexuella övergrepp (hbtqi)
related: Sexuellt samtycke
scope note: Används för skildringar av hbtqi-personer som har utsatts för våldtäkt.

Artister (hbtqi)
type: Concept
issued: 2022-05-19T10:12:00
modified: 2023-12-06T09:24:17
alternative label: Konstnärer (hbtqi)
broader: Hbtqi-personer
in scheme: Queerlit
narrower: Dansare (hbtqi)
narrower: Skådespelare (hbtqi)
narrower: Dragartister
narrower: Musiker (hbtqi)
related: Konst (hbtqi)
scope note: Används för skildringar av hbtqi-personer som är artister eller som återkommande använder konstnärliga uttryck.

Lesbiska relationer
type: Concept
issued: 2022-05-19T10:12:00
modified: 2022-10-26T08:10:16
broader: Homosexuella relationer
in scheme: Queerlit
related: Queera relationer
related: Transrelationer
related: Relationer mellan kvinnor
related: Bisexuella relationer
related: Intersexrelationer
scope note: Används för skildringar av nära relationer mellan lesbiska. Kan omfatta aspekter som släktskap, vänskap, sex och/eller kärlek.

Biologiska föräldrar (hbtqi)
type: Concept
issued: 2022-05-19T10:12:00
modified: 2023-12-06T09:24:17
broader: Föräldrar (hbtqi)
in scheme: Queerlit
related: Adoptivföräldrar (hbtqi)
related: Föräldrar till hbtqi-personer
related: Hbtqi-personer
related: Fosterföräldrar (hbtqi)
related: Adoption (hbtqi)
scope note: Används för skildringar av hbtqi-personer som är föräldrar med ett biologiskt släktskap med barnet men som inte nödvändigtvis är dess juridiska eller sociala föräldrar. Används även för skildringar av biologiska (men inte nödvändigtvis juridiska eller sociala) föräldrar till hbtqi-personer.

Intersexrelationer
type: Concept
issued: 2022-05-19T10:12:00
modified: 2024-03-19T10:00:33
broader: Relationer (hbtqi)
hidden label: Intersex-relationer
in scheme: Queerlit
related: Bögrelationer
related: Queera relationer
related: Transrelationer
related: Lesbiska relationer
related: Bisexuella relationer
scope note: Används för skildringar av nära relationer mellan intersexpersoner. Kan omfatta aspekter som släktskap, vänskap, sex eller kärlek.

Fosterföräldrar (hbtqi)
type: Concept
issued: 2022-05-19T10:12:00
modified: 2023-12-06T09:24:17
broader: Föräldrar (hbtqi)
broader: Fosterfamiljer (hbtqi)
hidden label: Foster-föräldrar
in scheme: Queerlit
related: Adoptivföräldrar (hbtqi)
related: Föräldrar till hbtqi-personer
related: Hbtqi-personer
related: Biologiska föräldrar (hbtqi)
scope note: Används för skildringar av hbtqi-personer som är eller varit fosterföräldrar. Används även för skildringar av fosterföräldrar till hbtqi-personer.

Turism (hbtqi)
type: Concept
issued: 2022-05-19T10:12:00
modified: 2023-12-06T09:24:17
alternative label: Hbtqi-turism
alternative label: Regnbågsturism
in scheme: Queerlit
narrower: Sexturism
narrower: Kryssningar (hbtqi)
related: Hotell (hbtqi)
related: Restauranger (hbtqi)
scope note: Används för skildringar av turism som marknadsförs riktat till hbtqi-personer samt resmål som ofta besöks av hbtqi-personer.
top concept of: Queerlit

Teater (hbtqi)
type: Concept
issued: 2022-05-19T10:12:00
modified: 2023-12-06T09:24:17
broader: Konst (hbtqi)
in scheme: Queerlit
narrower: Striptease
narrower: Herrimitatörer
narrower: Kabuki
narrower: Damimitatörer
narrower: Performancekonst
scope note: Används för skildringar av teater som utövas av, skrivits av eller på annat sätt kan kopplas till hbtqi-personer. Används ej för genren teater.

Exhibitionism
type: Concept
issued: 2022-05-19T10:12:00
modified: 2023-12-13T10:57:15
alternative label: Blottare
alternative label: Blottning
broader: Fetischism (sexualitet)
broader: Sexuella praktiker
broader: Sex
in scheme: Queerlit
related: Voyeurism
related: Sexmissbruk
related: Offentligt sex
scope note: Används för skildringar av personer som finner sexuell upphetsning i att visa sina könsorgan för eller bli betraktade i sexuella sammanhang av andra människor, både med och utan samtycke.

Kastrering
type: Concept
issued: 2022-05-19T10:12:00
modified: 2022-05-19T10:12:00
alternative label: Kastration
in scheme: Queerlit
narrower: Orkidektomi
related: Penektomi
related: Tvångssterilisering
related: Eunucker
scope note: Används för skildringar av att på kirurgisk väg avlägsna könskörtlarna (testiklarna respektive äggstockarna).
top concept of: Queerlit

Läderfamiljer
type: Concept
issued: 2022-05-19T10:12:00
modified: 2022-05-19T10:12:00
broader: Lädergemenskaper
broader: BDSM-gemenskaper
broader: Valda familjer (hbtqi)
hidden label: Läder-familjer
in scheme: Queerlit
narrower: Lädermammor
narrower: Läderpappor
related: SM
scope note: Används för skildringar av en nära krets personer som stöttar varandra och förenas i läderkulturen.

Klitorissex
type: Concept
issued: 2022-05-19T10:12:00
modified: 2022-05-19T10:12:00
broader: Sexuella praktiker
broader: Sex
hidden label: Klitoris-sex
in scheme: Queerlit
narrower: Cunnilingus
narrower: Klittra
related: Vaginalsex
related: Klitoris
scope note: Används för skildringar där klitoris stimuleras sexuellt.

Sex på offentliga toaletter
type: Concept
issued: 2022-05-19T10:12:00
modified: 2022-05-19T10:12:00
broader: Sexuella praktiker
broader: Sex
in scheme: Queerlit
related: Cruising
related: Anonymt sex
related: Offentliga toaletter
related: Offentligt sex
scope note: Används för skildringar av, ofta tillfälliga och anonyma, sexakter på offentliga toaletter.

Kroppslig närhet
type: Concept
issued: 2022-05-19T10:12:00
modified: 2024-03-19T10:00:33
alternative label: Fysisk intimitet
alternative label: Fysisk närhet
alternative label: Kroppslig intimitet
in scheme: Queerlit
narrower: Kyssar
related: Intimitet (hbtqi)
related: Massage
related: Erotik
scope note: Används för skildringar där kroppslig närhet som uttrycker vänskap, kärlek och/eller attraktion har betydelse för verket.
top concept of: Queerlit

Megasexuella
type: Concept
issued: 2022-05-19T10:12:00
modified: 2022-05-19T10:12:00
broader: Sexuell identitet
in scheme: Queerlit
related: Megasexualitet
related: Demisexuella
related: Känslor (hbtqi)
related: Sexuella relationer
related: Asexuella
scope note: Används för skildringar av personer som inte upplever en stark känslomässig koppling till andra personer om de inte först bildar en stark sexuell koppling till dem.

Teorier (hbtqi)
type: Concept
issued: 2022-05-19T10:12:00
modified: 2023-12-06T09:24:17
in scheme: Queerlit
narrower: Queerteori
narrower: Essentialism
narrower: Socialkonstruktivism
narrower: Förklaringsmodeller (hbtqi)
scope note: Används för skildringar av generaliserande modeller av hur könsidentitet, könsuttryck, begär eller sexualitet fungerar socialt eller biologiskt.
top concept of: Queerlit

Barn till transpersoner
type: Concept
issued: 2022-05-19T10:12:00
modified: 2024-06-05T11:38:19
broader: Barn till hbtqi-personer
in scheme: Queerlit
narrower: Barn till ickebinära
related: Transpappor
related: Transfamiljer
related: Transföräldrar
related: Transmammor
scope note: Används för skildringar av barn till personer som beskrivs som transpersoner.

Hatbrott
type: Concept
issued: 2022-05-19T10:12:00
modified: 2022-09-12T08:21:55
hidden label: Hat-brott
in scheme: Queerlit
related: Intolerans mot hbtqi-personer
related: Hatbrottsoffer (hbtqi)
related: Rasism (hbtqi)
related: Mord på hbtqi-personer
scope note: Används för skildringar av brott där ett motiv har varit att kränka en person, en folkgrupp eller en annan grupp av personer på grund av rasifiering, hudfärg, nationellt eller etniskt ursprung, trosbekännelse, sexuell läggning, könsöverskridande identitet eller uttryck eller annan liknande omständighet.
top concept of: Queerlit

Asexuella
type: Concept
issued: 2022-05-19T10:12:00
modified: 2022-05-19T10:12:00
alternative label: Aces
in scheme: Queerlit
related: Asexualitet
related: Celibat
related: Demisexuella
related: Megasexuella
scope note: Används för skildringar av personer som beskrivs som asexuella och har förmågan att inte känna sexuell attraktion.
top concept of: Queerlit

Pappor till hbtqi-personer
type: Concept
issued: 2022-05-19T10:12:00
modified: 2023-12-06T09:24:17
alternative label: Fäder till hbtqi-personer
alternative label: Hbtqi-personers fäder
alternative label: Hbtqi-personers pappor
broader: Pappor
broader: Föräldrar till hbtqi-personer
in scheme: Queerlit
narrower: Pappor till bisexuella
narrower: Pappor till intersexpersoner
narrower: Pappor till homosexuella
narrower: Pappor till transpersoner
narrower: Pappor till queera personer
scope note: Används för skildringar av pappor till hbtqi-personer, oavsett pappans egen identitet.

Könsstympning av intersexpersoner
type: Concept
issued: 2022-05-19T10:12:00
modified: 2022-05-19T10:12:00
in scheme: Queerlit
narrower: Penektomi
narrower: Klitoridektomi
related: Medborgerliga rättigheter (hbtqi)
related: Intersexpersoner
related: Könsstympning
scope note: Används för skildringar av kirurgiska ingrepp på intersexpersoner för att ge personen ett "entydigt kön" och som inte sker med samtycke från personen.
top concept of: Queerlit

Intolerans mot hbtqi-personer
type: Concept
issued: 2022-05-19T10:12:00
modified: 2023-12-06T09:24:17
alternative label: Missaktning mot hbtqi-personer
in scheme: Queerlit
related: Misogyni
related: Förföljelse av hbtqi-personer
related: Diskriminering av hbtqi-personer
related: Rasism (hbtqi)
related: Hatbrott
scope note: Används för skildringar av allmänna negativa attityder mot hbtqi-personer.
top concept of: Queerlit

Partnerpreferens
type: Concept
issued: 2022-05-19T10:12:00
modified: 2023-05-10T08:32:00
broader: Sexuell preferens
hidden label: Partner-preferens
in scheme: Queerlit
narrower: Polyamori
narrower: Monogami
narrower: Flersamma relationer
related: Partners (hbtqi)
related: Sexuell identitet
related: Sexuella relationer
scope note: Används för skildringar där preferens kring relationsform, som exempelvis flersamma eller monogama relationer, har betydelse för verket.

Symbolik (hbtqi)
type: Concept
issued: 2022-05-19T10:12:00
modified: 2023-12-06T09:24:17
in scheme: Queerlit
narrower: Förvandlingssymbolik (hbtqi)
narrower: Regnbågssymbolik (hbtqi)
narrower: Antik symbolik (hbtqi)
narrower: Spegelsymbolik (hbtqi)
narrower: Hemlighetssymbolik (hbtqi)
scope note: Används för skildringar där samkönade sexuella praktiker, känslor, identiteter och/eller överskridanden av binära könsnormer genom kropp, klädsel, identitet signaleras i omskrivningar, liknelser eller symbolik.
top concept of: Queerlit

Bögkultur
type: Concept
issued: 2022-05-19T10:12:00
modified: 2022-05-19T10:12:00
broader: Subkulturer
hidden label: Bög-kultur
in scheme: Queerlit
narrower: Chubs (identitet)
narrower: Uttrar (identitet)
narrower: Faeries
narrower: Björnar (identitet)
related: Sexuell identitet
related: Camp
scope note: Används för skildringar av kulturer eller uttryck präglade av bögars interaktion eller deltagande.

Könsorgan
type: Concept
issued: 2022-05-19T10:12:00
modified: 2022-05-19T10:12:00
alternative label: Genitalier
broader: Biologiskt kön
in scheme: Queerlit
narrower: Vulvor
narrower: Testiklar
narrower: Klitoris
narrower: Penisar
narrower: Vaginor
related: Erogena zoner
scope note: Används för skildringar där könsorgan har betydelse för verket.

Papperslösa hbtqi-personer
type: Concept
issued: 2022-05-19T10:12:00
modified: 2023-12-06T09:24:17
broader: Migranter (hbtqi)
in scheme: Queerlit
related: Asylrätt (hbtqi)
related: Förföljelse av hbtqi-personer
related: Rättsstatus
related: Juridik
related: Flyktingar (hbtqi)
related: Etniska grupper (hbtqi)
scope note: Används för skildringar av papperslösa hbtqi-personer. Med papperslös menas att personen vistas, arbetar eller studerar i ett land utan giltiga tillstånd.

Pappor
type: Concept
issued: 2022-05-19T10:12:00
modified: 2023-12-13T10:57:15
alternative label: Farsor
alternative label: Fäder
broader: Föräldrar (hbtqi)
in scheme: Queerlit
narrower: Pappor till hbtqi-personer
narrower: Transpappor
narrower: Två pappor
narrower: Ensamstående pappor (hbtqi)
narrower: Bögföräldrar
narrower: Medpappor (hbtqi)
scope note: Används för skildringar av pappor.

Oralsex
type: Concept
issued: 2022-05-19T10:12:00
modified: 2024-09-05T13:44:36
broader: Sexuella praktiker
broader: Sex
in scheme: Queerlit
narrower: Kyssar
narrower: Bitning (sexualitet)
narrower: Slicksex
narrower: Cunnilingus
narrower: Fellatio
scope note: Används för skildringar av att stimulera sexuellt med mun och tunga.

Anonymt sex
type: Concept
issued: 2022-05-19T10:12:00
modified: 2022-05-19T10:12:00
broader: Sexuella praktiker
in scheme: Queerlit
related: Cruising
related: Sexställen
related: Sexualitet
related: Tillfälligt sex
related: Sexuella relationer
related: Sex på offentliga toaletter
scope note: Används för skildringar av sexuella aktiviteter där deltagarna är anonyma för varandra.

Namnändring
type: Concept
issued: 2022-05-19T10:12:00
modified: 2023-03-29T10:53:01
alternative label: Namnbyte
broader: Familjerätt (hbtqi)
broader: Officiell dokumentation
hidden label: Namn-byte
hidden label: Namn-ändring
in scheme: Queerlit
related: Juridiskt namn
related: Pass
related: Id-kort
related: Körkort
related: Äktenskap
scope note: Används för skildringar av byte av för- och/eller efternamn.

Föräldrar till homosexuella
type: Concept
issued: 2022-05-19T10:12:00
modified: 2022-06-07T15:09:28
alternative label: Homosexuellas föräldrar
broader: Föräldrar till hbtqi-personer
in scheme: Queerlit
narrower: Föräldrar till bögar
narrower: Mammor till homosexuella
narrower: Pappor till homosexuella
narrower: Föräldrar till lesbiska
related: Homosexuella
related: Homosexuella barn
scope note: Används för skildringar av föräldrar till homosexuella, oavsett biologiskt släktskap.

Mammor till hbtqi-personer
type: Concept
issued: 2022-05-19T10:12:00
modified: 2023-12-06T09:24:17
alternative label: Hbtqi-personers mammor
alternative label: Hbtqi-personers mödrar
alternative label: Mödrar till hbtqi-personer
broader: Föräldrar till hbtqi-personer
broader: Mammor
in scheme: Queerlit
narrower: Mammor till bisexuella
narrower: Mammor till intersexpersoner
narrower: Mammor till transpersoner
narrower: Mammor till queera personer
narrower: Mammor till homosexuella
scope note: Används för skildringar av mammor till hbtqi-personer, oavsett mammans egen identitet.

Androgynitet
type: Concept
issued: 2022-05-19T10:12:00
modified: 2022-05-19T10:12:00
broader: Könsuttryck
broader: Könsöverskridanden
in scheme: Queerlit
related: Maskulinitet
related: Genderbending
related: Femininitet
related: Androgyna personer
related: Könsroller
scope note: Används för skildringar av det att i sitt könsuttryck eller sin könsidentitet kombinera maskulina och feminina drag.

Transstudier
type: Concept
issued: 2022-05-19T10:12:00
modified: 2023-03-29T10:53:01
alternative label: Transforskning
broader: Könsöverskridanden
broader: Genusvetenskap
hidden label: Trans-forskning
hidden label: Trans-studier
in scheme: Queerlit
related: Bisexualitetsstudier
related: Homosexualitetsstudier
related: Lesbiska studier
related: Queerstudier
related: Bögstudier
scope note: Används för skildringar av det vetenskapliga fält som fokuserar på studier av könsöverskridande identiteter, sammanhang, livsvillkor och erfarenheter.

Bisexuella män
type: Concept
issued: 2022-05-19T10:12:00
modified: 2023-12-06T09:24:17
alternative label: Bimän
alternative label: Manliga bisexuella
broader: Bisexuella
broader: Män
in scheme: Queerlit
narrower: Unga bisexuella män
narrower: Bisexuella pojkar
narrower: Äldre bisexuella män
related: Män som har sex med män
related: Kärlek mellan män
scope note: Används för skildringar av personer som beskrivs som män och som har förmågan att känna sexuell och/eller romantisk attraktion till människor oavsett kön.

Vaginalsex
type: Concept
issued: 2022-05-19T10:12:00
modified: 2022-05-19T10:12:00
broader: Sexuella praktiker
broader: Sex
in scheme: Queerlit
narrower: Fistning
narrower: Fingersex
narrower: Cunnilingus
narrower: Vaginala samlag
related: Klitorissex
scope note: Används för skildringar av sex som involverar vaginan.

Offentliga hygieninrättningar
type: Concept
issued: 2022-05-19T10:12:00
modified: 2022-05-19T10:12:00
in scheme: Queerlit
narrower: Offentliga toaletter
narrower: Omklädningsrum
narrower: Offentliga duschar
related: Hbtqi-mötesplatser
related: Diskrimineringslagstiftning
scope note: Används för skildringar av hygieninrättningar som är tillgängliga för allmänheten, för kunder, skolelever, anställda i ett företag eller annan liknande grupp.
top concept of: Queerlit

Körer (hbtqi)
type: Concept
issued: 2022-05-19T10:12:00
modified: 2023-12-06T09:24:17
alternative label: Hbtqi-körer
alternative label: Regnbågskörer
in scheme: Queerlit
narrower: Lesbiska körer
narrower: Bögkörer
related: Hbtqi-föreningar
related: Musiker (hbtqi)
related: Konst (hbtqi)
scope note: Används för skildringar av körer bestående av främst hbtqi-personer.
top concept of: Queerlit

Flickor
type: Concept
issued: 2022-05-19T10:12:00
modified: 2022-09-13T11:22:43
alternative label: Tjejer
broader: Barn
in scheme: Queerlit
narrower: Bisexuella flickor
narrower: Transflickor
narrower: Pojkflickor
narrower: Heterosexuella flickor
narrower: Lesbiska flickor
related: Flickors vänskap
scope note: Används för skildringar av personer som beskrivs som flickor - i regel personer under 15 år.

Bisexuella kvinnor
type: Concept
issued: 2022-05-19T10:12:00
modified: 2023-12-06T09:24:17
alternative label: Bikvinnor
alternative label: Kvinnliga bisexuella
broader: Kvinnor
broader: Bisexuella
in scheme: Queerlit
narrower: Äldre bisexuella kvinnor
narrower: Bisexuella flickor
narrower: Unga bisexuella kvinnor
related: Kvinnor som har sex med kvinnor
related: Kärlek mellan kvinnor
scope note: Används för skildringar av personer som beskrivs som kvinnor och som har förmågan att känna sexuell och/eller romantisk attraktion till människor oavsett kön.

Demisexuella
type: Concept
issued: 2022-05-19T10:12:00
modified: 2022-05-19T10:12:00
broader: Sexuell preferens
broader: Sexuell identitet
in scheme: Queerlit
related: Demisexualitet
related: Känslor (hbtqi)
related: Sexuella relationer
related: Megasexuella
related: Asexuella
scope note: Används för skildringar av demisexuella personer - demisexuella utvecklar sexuell attraktion till någon först efter att ha skapat ett starkt känslomässigt band till personen.

Situationsbetingat sexuellt beteende
type: Concept
issued: 2022-05-19T10:12:00
modified: 2022-11-16T11:33:32
alternative label: Situationsbetingad homosexualitet
in scheme: Queerlit
related: Sexuell preferens
related: Sexualitet
related: Skolan (hbtqi)
related: Sexuella praktiker
related: Sex
scope note: Används för skildringar av situationer då personers sexuella beteende skiljer sig från hur det vanligen yttrar sig, beroende på yttre omständigheter. Vanligen gäller det heterosexuella personer som befinner sig i enkönade miljöer, som fängelser, armén, skolor med mera, och där utövar samkönad sexuell praktik.
top concept of: Queerlit

Pojkar
type: Concept
issued: 2022-05-19T10:12:00
modified: 2022-09-13T11:22:43
alternative label: Gossar
alternative label: Killar
broader: Barn
in scheme: Queerlit
narrower: Heterosexuella pojkar
narrower: Flickpojkar
narrower: Transpojkar
narrower: Bisexuella pojkar
narrower: Homosexuella pojkar
related: Pojkars vänskap
scope note: Används för skildringar av personer som beskrivs som pojkar - i regel personer under 15 år.

Barn till hbtqi-personer
type: Concept
issued: 2022-05-19T10:12:00
modified: 2023-12-06T09:24:17
alternative label: Regnbågsbarn
broader: Familjemedlemmar
in scheme: Queerlit
narrower: Barn till queera personer
narrower: Barn till homosexuella
narrower: Barn till intersexpersoner
narrower: Barn till bisexuella
narrower: Barn till transpersoner
related: Adoption (hbtqi)
scope note: Används för skildringar av barn till personer som beskrivs som homosexuella, bisexuella, transpersoner, queera och/eller intersexpersoner.

Hälso- och sjukvård
type: Concept
issued: 2022-05-19T10:12:00
modified: 2022-05-19T10:12:00
alternative label: Medicinsk vård
in scheme: Queerlit
narrower: Medikalisering
narrower: Terapier och behandlingar
narrower: Hälso- och sjukvård (hbtqi)
related: Donatorer (medicin)
related: Läkarutlåtanden
scope note: Används för skildringar av hälsa och sjukvård på ett generellt plan.
top concept of: Queerlit

Passera (kön)
type: Concept
issued: 2022-05-19T10:12:00
modified: 2022-05-19T10:12:00
alternative label: Att passera
broader: Könsöverskridanden
in scheme: Queerlit
related: Offentliga toaletter
related: Intersexpersoner
related: Femmes
related: Kön
related: Stealth (transpersoner)
related: Transpersoner
scope note: Används för skildringar där frågor om att passera eller inte passera har betydelse för verket. Med passera menas att som transperson uppfattas som sitt egentliga kön - det kön en själv identifierar sig som - av främlingar.

Sexuell dysfunktion
type: Concept
issued: 2022-05-19T10:12:00
modified: 2022-05-19T10:12:00
in scheme: Queerlit
narrower: Erektil dysfunktion
narrower: Vulvasmärtor
related: Sexualitet
related: Sexterapi
related: Sexuell upphetsning
scope note: Används för skildringar av fysiologiska och psykologiska svårigheter att ha sex.
top concept of: Queerlit

Femininitet
type: Concept
issued: 2022-05-19T10:12:00
modified: 2022-12-07T08:49:58
alternative label: Femininiteter
alternative label: Kvinnlighet
broader: Könsuttryck
in scheme: Queerlit
narrower: Mäns femininitet
related: Maskulinitet
related: Transfeminina
related: Androgynitet
related: Femmes
related: Könsroller
scope note: Används för skildringar där attribut, beteenden och roller som i allmänhet förknippas med kvinnor har en framträdande betydelse för verket.

Eonism
type: Concept
issued: 2022-05-19T10:12:00
modified: 2022-05-19T10:12:00
broader: Könsöverskridanden
broader: Historiska termer (hbtqi)
in scheme: Queerlit
related: Transvestism
related: Crossdressing
related: Transsexualism
related: Sexuell inversion
related: Transpersoner
scope note: Används för skildringar, historiska eller historiserande, som använder begreppet eonism - ett äldre ord för att beskriva feminina könsuttryck hos personer som tilldelats könet man vid födseln.

Sexklubbar
type: Concept
issued: 2022-05-19T10:12:00
modified: 2023-03-29T10:53:01
alternative label: Porrklubbar
broader: Sexställen
broader: Hbtqi-föreningar
broader: Sexindustri
hidden label: Sex-klubbar
in scheme: Queerlit
related: Sexualitet
related: Uteliv (hbtqi)
related: Sexfester
related: Dark rooms
scope note: Används för skildringar av organiserade sammankomster, både självorganiserade och kommersiella och ofta i särskilt anpassade lokaler, där besökarna har möjlighet att och förväntas ha sex med varandra, eller se på när andra har sex eller uppträder med exempelvis striptease.

Sociala rörelser
type: Concept
issued: 2022-05-19T10:12:00
modified: 2022-05-19T10:12:00
in scheme: Queerlit
narrower: Hbtqi-rörelser
narrower: Mansrörelser
narrower: Ex-gayrörelser
narrower: Kvinnorörelser
narrower: SM-rörelser
scope note: Används för skildringar av sammanslutningar och sammanhang där personer strävar efter att förändra vad som uppfattas som missförhållanden i samhället eller världen.
top concept of: Queerlit

Hälso- och sjukvård (hbtqi)
type: Concept
issued: 2022-05-19T10:12:00
modified: 2023-12-06T09:24:17
alternative label: Hälso- och sjukvård för hbtqi-personer
alternative label: Medicinsk vård för hbtqi-personer
broader: Hälso- och sjukvård
in scheme: Queerlit
narrower: Könsidentitetsutredning
narrower: Somatisk vård (hbtqi)
narrower: Vård i livets slutskede (aids)
narrower: Kompisvård (hbtqi)
narrower: Könsbekräftande behandling
narrower: Psykiatrisk vård (hbtqi)
scope note: Används för skildringar av hälsa och sjukvård där kopplingen till hbtqi har en framträdande betydelse.

Mammor
type: Concept
issued: 2022-05-19T10:12:00
modified: 2023-12-13T10:57:15
alternative label: Morsor
alternative label: Mödrar
broader: Föräldrar (hbtqi)
in scheme: Queerlit
narrower: Mammor till hbtqi-personer
narrower: Lesbiska föräldrar
narrower: Två mammor
narrower: Transmammor
narrower: Ensamstående mammor (hbtqi)
narrower: Medmammor (hbtqi)
scope note: Används för skildringar av mammor.

Säkrare sex
type: Concept
issued: 2022-05-19T10:12:00
modified: 2022-05-19T10:12:00
alternative label: Säkert sex
broader: Sexuella praktiker
broader: Sex
in scheme: Queerlit
related: Preventivmedel
related: Kondomer
related: Sexuella riskbeteenden
related: Slicklappar
related: Latexhandskar
scope note: Används för skildringar av olika metoder för minska risken för sexuellt överförbara infektioner, exempelvis genom att använda skydd eller ha sex på sätt som minskar risken för smitta.

Körkort
type: Concept
issued: 2022-05-19T10:12:00
modified: 2024-09-05T13:44:36
broader: Officiell dokumentation
in scheme: Queerlit
related: Juridiskt namn
related: Namnändring
related: Domstolsbeslut
related: Läkarutlåtanden
related: Id-kort
related: Transitionering
scope note: Används för skildringar där körkort, t.ex. i samband med namnbyte, har betydelse för verket.

Tilldelat kön vid födseln
type: Concept
issued: 2022-05-19T10:12:00
modified: 2023-03-29T10:25:38
alternative label: Kön tilldelat vid födseln
alternative label: Kön tillskrivet vid födseln
alternative label: Tilldelat kön
alternative label: Tillskrivet kön
alternative label: Tillskrivet kön vid födseln
broader: Könsöverskridanden
broader: Biologiskt kön
in scheme: Queerlit
narrower: AMAB
narrower: AFAB
related: Juridiskt kön
related: Transitionering
related: Stealth (transpersoner)
scope note: Används för skildringar av kön, antingen flicka eller pojke, som tilldelas ett barn vid födseln baserat på hur barnets kropp tolkas. Används när det tilldelade könet har betydelse för verket, huvudsakligen i de fall där det inte överensstämmer med personers senare könsidentitet.

Dragfamiljer
type: Concept
issued: 2022-05-19T10:12:00
modified: 2022-05-19T10:12:00
broader: Draggemenskaper
broader: Valda familjer (hbtqi)
hidden label: Drag-familjer
in scheme: Queerlit
narrower: Dragpappor
narrower: Dragmammor
related: Dragqueens
related: Dragkings
related: Ballroomfamiljer
scope note: Används för skildringar av en nära krets personer som stöttar varandra och förenas i dragkulturen.

Ungdomar
type: Concept
issued: 2022-05-19T10:12:00
modified: 2022-05-19T10:12:00
in scheme: Queerlit
narrower: Okönade unga
narrower: Unga heterosexuella
narrower: Hbtqi-ungdomar
related: Efebofili
related: Barn
scope note: Används för skildringar av personer som beskrivs som ungdomar, i gränslandet mellan barn och vuxen - i regel mellan 15 och 25 år.
top concept of: Queerlit

Sexuell upphetsning
type: Concept
issued: 2022-05-19T10:12:00
modified: 2022-05-19T10:12:00
alternative label: Kåthet
in scheme: Queerlit
narrower: Orgasm
related: Sexualitet
related: Erotik
related: Sexuell dysfunktion
related: Sex
scope note: Används för skildringar av sexuell upphetsning, oavsett om känslan innefattar eller leder till sexuella handlingar eller inte.
top concept of: Queerlit

Döden och döende (hbtqi)
type: Concept
issued: 2022-05-19T10:12:00
modified: 2023-12-06T09:24:17
in scheme: Queerlit
narrower: Suicid (hbtqi)
related: Sorg (hbtqi)
related: Vård i livets slutskede (aids)
related: Mord på hbtqi-personer
related: Hbtqi-minnesmärken
scope note: Används för skildringar av döden och döende där kopplingen till hbtqi har en framträdande betydelse.
top concept of: Queerlit

Föräldrar till transpersoner
type: Concept
issued: 2022-05-19T10:12:00
modified: 2023-12-13T10:57:15
alternative label: Transpersoners föräldrar
broader: Föräldrar till hbtqi-personer
in scheme: Queerlit
narrower: Mammor till transpersoner
narrower: Föräldrar till transmän
narrower: Föräldrar till ickebinära personer
narrower: Föräldrar till transkvinnor
narrower: Pappor till transpersoner
related: Transbarn
related: Transpersoner
scope note: Används för skildringar av föräldrar till transpersoner, oavsett biologiskt släktskap.

Cruising
type: Concept
issued: 2022-05-19T10:12:00
modified: 2024-09-05T13:44:36
alternative label: Parkraggande
alternative label: Parkraggning
broader: Raggning (hbtqi)
broader: Sexuella praktiker
broader: Sex
in scheme: Queerlit
related: Hbtqi-mötesplatser
related: Anonymt sex
related: Tillfälligt sex
related: Sex på offentliga toaletter
related: Offentligt sex
scope note: Används för skildringar av att gå eller köra runt en plats, till exempel ett parkområde, för att leta efter en sexpartner, vanligtvis anonymt och tillfälligt.

Maskulinitet
type: Concept
issued: 2022-05-19T10:12:00
modified: 2022-12-07T08:49:58
alternative label: Manlighet
broader: Könsuttryck
in scheme: Queerlit
narrower: Kvinnors maskulinitet
related: Androgynitet
related: Transmaskulina
related: Machokultur
related: Femininitet
related: Butchar
related: Könsroller
scope note: Används för skildringar där beteenden eller egenskaper som traditionellt sett förknippas med, eller anses vara passande för, män har betydelse för verket.

Trakasserier
type: Concept
issued: 2022-05-19T10:12:00
modified: 2022-09-12T08:21:55
in scheme: Queerlit
narrower: Polistrakasserier
narrower: Sexuella trakasserier
related: Skällsord
related: Mobbning
related: Diskriminering av hbtqi-personer
related: Rasism (hbtqi)
scope note: Används för skildringar av att brett spektrum av kränkande beteenden som är menade att störa och uppröra, är repetitiva till sin karaktär och sker med intention.
top concept of: Queerlit

Samboförhållanden
type: Concept
issued: 2022-05-19T10:12:00
modified: 2023-03-29T10:53:01
alternative label: Sambos
alternative label: Sambosar
alternative label: Sammanboende
broader: Samlevnadsformer
hidden label: Sambo-förhållanden
in scheme: Queerlit
related: Samboavtal
related: Partners (hbtqi)
related: Hbtqi-par
related: Relationer (hbtqi)
related: Officiell dokumentation
related: Registrerade partnerskap
related: Äktenskap
scope note: Används för skildringar av parförhållanden där personer lever tillsammans i gemensam bostad utan att vara gifta.

Offer för sexuella övergrepp (hbtqi)
type: Concept
issued: 2022-05-19T10:12:00
modified: 2023-12-06T09:24:17
alternative label: Hbtqi-personer drabbade av sexbrott
alternative label: Hbtqi-personer drabbade av sexuella övergrepp
alternative label: Hbtqi-personer drabbade av sexuellt våld
alternative label: Hbtqi-personer utsatta för sexbrott
alternative label: Hbtqi-personer utsatta för sexuella övergrepp
alternative label: Hbtqi-personer utsatta för sexuellt våld
alternative label: Offer för sexbrott (hbtqi)
alternative label: Offer för sexuellt våld (hbtqi)
broader: Brottsoffer (hbtqi)
in scheme: Queerlit
narrower: Barn utsatta för sexuella övergrepp (hbtqi)
narrower: Våldtäktsoffer (hbtqi)
narrower: Offer för incest (hbtqi)
related: Sexuella övergrepp (hbtqi)
related: Våld mot hbtqi-personer
related: Våld i nära relationer (hbtqi)
related: Sexuellt samtycke
scope note: Används för skildringar av hbtqi-personer som utsätts eller har utsatts för sexuella övergrepp.

Biologiskt kön
type: Concept
issued: 2022-05-19T10:12:00
modified: 2022-05-19T10:12:00
alternative label: Endokrint kön
alternative label: Genetiskt kön
alternative label: Kroppsligt kön
broader: Kön
in scheme: Queerlit
narrower: Könsorgan
narrower: Transsexuella
narrower: Kromosomer
narrower: Könskörtlar
narrower: Hormoner
narrower: Intersextillstånd
narrower: Tilldelat kön vid födseln
scope note: Används för skildringar där reflektioner över biologiskt kön - det kön som bestäms utifrån inre och yttre könsorgan, könskromosomer och hormonnivåer - har betydelse för verket.

Transsexuella
type: Concept
issued: 2022-05-19T10:12:00
modified: 2023-03-29T10:25:38
broader: Biologiskt kön
broader: Transpersoner
hidden label: Transexuella
in scheme: Queerlit
related: Könsdysfori
related: Transsexualism
related: Könseufori
related: Pansexuella
related: Könsbekräftande behandling
related: Transitionering
scope note: Används för skildringar av personer som har fått eller strävar efter att få diagnosen transsexualism. För skildringar som inte fokuserar på diagnos och behandling, använd ämnesordet "Transpersoner".

Transsexualism
type: Concept
issued: 2022-05-19T10:12:00
modified: 2023-03-07T14:30:20
alternative label: GID
alternative label: Könsidentitetsstörningar
alternative label: Transsexualitet
broader: Könsöverskridanden
broader: Medikalisering
hidden label: Transexualism
hidden label: Transexualitet
in scheme: Queerlit
related: Könsdysfori
related: Transsexuella
related: Röstträning (transpersoner)
related: Eonism
related: Transitionering
related: Transpersoner
scope note: Används för skildringar av diagnosen transsexualism eller könsidentitetsstörning. För skildringar som inte fokuserar på diagnos och behandling, använd ämnesordet "Transpersoner".

Hbtqi-föreningar
type: Concept
issued: 2022-05-19T10:12:00
modified: 2023-12-06T09:24:17
in scheme: Queerlit
narrower: Studentföreningar (hbtqi)
narrower: Motorcykelklubbar (hbtqi)
narrower: Sexklubbar
narrower: Idrottsföreningar (hbtqi)
related: Körer (hbtqi)
related: Bokcirklar (hbtqi)
scope note: Används för skildringar av föreningar för hbtqi-personer och/eller för hbtqi-frågor.
top concept of: Queerlit

Medikalisering
type: Concept
issued: 2022-05-19T10:12:00
modified: 2022-09-13T11:22:43
alternative label: Patologisering
broader: Hälso- och sjukvård
in scheme: Queerlit
narrower: Könsdysfori
narrower: Transsexualism
narrower: Sexuell inversion
narrower: Intersextillstånd
related: Socialkonstruktivism
related: Ockupationen av Socialstyrelsen 1979
related: Förklaringsmodeller (hbtqi)
scope note: Används för skildringar av processer där mänskliga tillstånd och problem definieras och behandlas som medicinska tillstånd och blir föremål för medicinska studier, diagnoser, förebyggande åtgärder och/eller behandlingar.

Adoptivföräldrar (hbtqi)
type: Concept
issued: 2022-05-19T10:12:00
modified: 2023-12-20T08:43:57
broader: Föräldrar (hbtqi)
broader: Adoptivfamiljer (hbtqi)
hidden label: Adoptiv-föräldrar
in scheme: Queerlit
related: Föräldrar till hbtqi-personer
related: Hbtqi-personer
related: Biologiska föräldrar (hbtqi)
related: Fosterföräldrar (hbtqi)
related: Adoption (hbtqi)
related: Adopterade (hbtqi)
scope note: Används för skildringar av hbtqi-personer som blivit föräldrar genom adoption, och/eller skildringar av adoptivföräldrar till hbtqi-personer.

Vänskap
type: Concept
issued: 2022-05-19T10:12:00
modified: 2024-06-05T11:38:19
alternative label: Kamratskap
alternative label: Kompisar
alternative label: Vänner
broader: Relationer (hbtqi)
in scheme: Queerlit
narrower: Svärmisk vänskap
narrower: Kvinnors vänskap
narrower: Pojkars vänskap
narrower: Flickors vänskap
narrower: Mäns vänskap
related: Kär i kompis (hbtqi)
related: Homosocialitet
scope note: Används för skildringar av nära sociala relationer präglade av ömsesidig respekt, förtroende och sympati.

Dragqueens
type: Concept
issued: 2022-05-19T10:12:00
modified: 2022-06-07T15:09:28
alternative label: Drag queens
alternative label: Drag-drottningar
alternative label: Drag-queens
alternative label: Dragdrottningar
alternative label: Drugor
broader: Dragartister
in scheme: Queerlit
narrower: Dragpappor
narrower: Dragmammor
related: Crossdressing
related: Draggemenskaper
related: Dragkings
related: Damimitatörer
related: Dragfamiljer
scope note: Används för skildringar av personer som ikläder sig kvinnligt kodade attribut, ofta i överdriven tappning, i underhållningssyfte och/eller som uttryck för en subkultur präglad av experimentella eller parodierande könsuttryck.

Tillfälligt sex
type: Concept
issued: 2022-05-19T10:12:00
modified: 2023-05-10T08:32:00
broader: Sexuella praktiker
broader: Sexuella relationer
in scheme: Queerlit
related: Raggning (hbtqi)
related: Cruising
related: Sexuell preferens
related: Anonymt sex
related: Gruppsex
related: Sexualitet
scope note: Används för skildringar av tillfälliga sexuella kontakter.

Ursprungsbefolkningar (hbtqi)
type: Concept
issued: 2022-05-19T10:12:00
modified: 2023-12-06T09:24:17
alternative label: Urbefolkningar (hbtqi)
alternative label: Urfolk (hbtqi)
alternative label: Urinvånare (hbtqi)
broader: Icke-vita hbtqi-personer
in scheme: Queerlit
narrower: Samer (hbtqi)
narrower: Ursprungsamerikaner (hbtqi)
narrower: Inuiter (hbtqi)
narrower: Aboriginer (hbtqi)
related: Rituell homosexualitet
related: Etniska grupper (hbtqi)
related: Two-spirit
scope note: Används för skildringar av hbtqi-personer inom folkgrupper som definieras som ursprungsbefolkningar - ättlingar till de befolkningsgrupper som ursprungligen bebott områden som senare koloniserats och/eller invaderats.

Bondage
type: Concept
issued: 2022-05-19T10:12:00
modified: 2022-05-19T10:12:00
alternative label: B&D
alternative label: Bondage and discipline
alternative label: Bondage och disciplin
broader: Sexuella praktiker
broader: BDSM
in scheme: Queerlit
narrower: Replekar (BDSM)
related: Sexuell preferens
related: BDSM-gemenskaper
related: Masochism
related: Sadism
related: Sexuellt samtycke
scope note: Används för skildringar av sexuella praktiker där en eller flera personers rörelsefrihet begränsas, t.ex. med hjälp av rep eller kedjor.

Sexslavar (hbtqi)
type: Concept
issued: 2022-05-19T10:12:00
modified: 2024-03-19T10:00:33
broader: Sexuella roller
broader: Sexuell identitet
in scheme: Queerlit
related: Dominatrixer (hbtqi)
related: Dominanta (hbtqi)
related: SM
related: Masters (hbtqi)
related: BDSM
related: Undergivna (hbtqi)
scope note: Används för skildringar av personer som inom BDSM frivilligt går in i rollen som slav i en slav/master-dynamik. Används för skildringar av sexslavar där kopplingen till HBTQI har en framträdande betydelse. Används ej för skildringar av sexuell exploatering och trafficking.

Registrerade partnerskap
type: Concept
issued: 2022-05-19T10:12:00
modified: 2023-12-06T09:24:17
alternative label: Partnerskap
broader: Samlevnadsformer
in scheme: Queerlit
related: Äktenskapslagstiftning
related: Frieri (hbtqi)
related: Samboförhållanden
related: Familjerätt (hbtqi)
related: Officiell dokumentation
related: Rättsstatus
related: Äktenskap
scope note: Används för skildringar av registrerade partnerskap - de juridiskt erkända samkönade samlevnadsformer som lagstiftningen inte likställer med olikkönade äktenskap.

Okönade personer
type: Concept
issued: 2022-05-19T10:12:00
modified: 2022-10-26T08:10:16
in scheme: Queerlit
narrower: Okönade unga
narrower: Okönade barn
narrower: Okönade äldre
narrower: Okönade föräldrar
related: Ickebinära personer
related: Agenderpersoner
scope note: Används för skildringar av personer vars könstillhörighet inte framgår, och där detta har betydelse för verket. Det kan handla om personer som beskrivs med könsneutrala pronomen eller där inga könande tillskrivningar görs. För skildringar av personer som beskrivs som ickebinära eller agender, använd ämnesorden "Ickebinära personer" eller "Agenderpersoner".
top concept of: Queerlit

Donatorer (medicin)
type: Concept
issued: 2022-05-19T10:12:00
modified: 2022-05-19T10:12:00
in scheme: Queerlit
narrower: Blodgivare (hbtqi)
narrower: Spermadonatorer
narrower: Äggdonatorer
related: Familjerätt (hbtqi)
related: Hälso- och sjukvård
related: Surrogatskap
scope note: Används för skildringar av personer som donerar någonting från sin egen kropp, t.ex. organ, blod eller könsceller.
top concept of: Queerlit

Masochism
type: Concept
issued: 2022-05-19T10:12:00
modified: 2022-05-19T10:12:00
broader: Sexuell preferens
broader: SM
broader: Fetischism (sexualitet)
broader: BDSM
in scheme: Queerlit
related: BDSM-gemenskaper
related: Sexuell identitet
related: Bondage
related: Sex
scope note: Används för skildringar av sexuell njutning orsakad av psykisk eller fysisk smärta tillfogad av en själv eller andra.

Femmes
type: Concept
issued: 2022-05-19T10:12:00
modified: 2022-06-07T15:09:28
alternative label: Läppstiftslesbiska
broader: Sexuell identitet
broader: Lesbiska
in scheme: Queerlit
related: Sexuell identitet
related: Butch-femme relationer
related: Passera (kön)
related: Femininitet
related: Butchar
related: Könsroller
scope note: Används för skildringar av personer som beskrivs som femmes - huvudsakligen lesbiska eller bisexuella kvinnor med könsuttryck och attribut som kodats som feminina.

Bisexuella relationer
type: Concept
issued: 2022-05-19T10:12:00
modified: 2022-10-26T08:10:16
broader: Relationer (hbtqi)
in scheme: Queerlit
related: Relationer mellan män
related: Bögrelationer
related: Queera relationer
related: Transrelationer
related: Relationer mellan kvinnor
related: Lesbiska relationer
related: Intersexrelationer
scope note: Används för skildringar av nära relationer mellan bisexuella. Kan omfatta aspekter som släktskap, vänskap, sex eller kärlek.

Dragkings
type: Concept
issued: 2022-05-19T10:12:00
modified: 2022-06-07T15:09:28
alternative label: Drag kings
alternative label: Drag-kings
alternative label: Drag-kungar
alternative label: Dragkungar
broader: Dragartister
in scheme: Queerlit
narrower: Dragpappor
narrower: Dragmammor
related: Herrimitatörer
related: Crossdressing
related: Draggemenskaper
related: Dragqueens
related: Dragfamiljer
scope note: Används för skildringar av personer som ikläder sig manligt kodade attribut, ofta i överdriven tappning, i underhållningssyfte och/eller som uttryck för en subkultur präglad av experimentella eller parodierande könsuttryck.

Rasism (hbtqi)
type: Concept
issued: 2022-05-19T10:12:00
modified: 2023-12-06T09:24:17
in scheme: Queerlit
related: Intolerans mot hbtqi-personer
related: Trakasserier
related: Diskriminering av hbtqi-personer
related: Etniska grupper (hbtqi)
related: Diskrimineringslagstiftning
related: Hatbrott
scope note: Används för skildringar av idéer, fördomar och handlingar baserade på föreställningar om en hierarkisk uppdelning av människor i raser, då dessa drabbar och/eller upprätthålls av hbtqi-personer.
top concept of: Queerlit

Terapier och behandlingar
type: Concept
issued: 2022-05-19T10:12:00
modified: 2024-09-05T13:44:36
broader: Hälso- och sjukvård
in scheme: Queerlit
narrower: Sexuell omvändelse
narrower: Elbehandling
narrower: Sexterapi
narrower: Läkemedel
narrower: Beteendeterapi
narrower: Aversionsterapi (hbtqi)
related: Psykiatrisk vård (hbtqi)
scope note: Används för skildringar av olika terapiformer och medicinska behandlingar.

Butchar
type: Concept
issued: 2022-05-19T10:12:00
modified: 2022-12-07T08:49:58
alternative label: Kvinnlig maskulinitet
broader: Sexuell identitet
broader: Lesbiska
in scheme: Queerlit
related: Maskulinitet
related: Kvinnors maskulinitet
related: Butch-femme relationer
related: Femmes
related: Pojkflickor
related: Könsroller
scope note: Används för skildringar av personer som beskrivs som butchar - huvudsakligen lesbiska eller bisexuella kvinnor med könsuttryck och attribut som kodats som maskulina.

Civilstånd
type: Concept
issued: 2022-05-19T10:12:00
modified: 2022-05-19T10:12:00
broader: Äktenskap
in scheme: Queerlit
narrower: Skilda personer
narrower: Gifta hbtqi-par
narrower: Änkor och änklingar
narrower: Singlar
related: Äktenskapslagstiftning
related: Separationer (hbtqi)
related: Rättsstatus
scope note: Används för skildringar där olika civilstånd har betydelse för verket.

Penisar
type: Concept
issued: 2022-05-19T10:12:00
modified: 2022-05-19T10:12:00
alternative label: Kukar
alternative label: Snoppar
broader: Könsorgan
broader: Erogena zoner
in scheme: Queerlit
related: Strap-onsex
related: Tuckning
related: Dildoar
related: Packing (fallos)
related: Fellatio
related: Penisringar
scope note: Används för skildringar av könsorgan som kännetecknas av svällkroppar som omger urinröret.

Hbtqi-separatism
type: Concept
issued: 2022-05-19T10:12:00
modified: 2023-12-06T09:24:17
in scheme: Queerlit
narrower: Transseparatism
narrower: Bisexuell separatism
narrower: Queerseparatism
narrower: Intersexseparatism
narrower: Homosexuell separatism
related: Könsförhållanden
scope note: Används för skildringar av frivillig ideologisk, social, kulturell och ibland fysisk separation av hbtqi-personer från heterosexuella och/eller cispersoner.
top concept of: Queerlit

Stealth (transpersoner)
type: Concept
issued: 2022-05-19T10:12:00
modified: 2022-05-19T10:12:00
alternative label: Garderobstranspersoner
broader: Könsöverskridanden
in scheme: Queerlit
related: Diskretion (hbtqi)
related: Outning
related: Komma ut
related: Passera (kön)
related: Kön
related: Tilldelat kön vid födseln
related: Transpersoner
scope note: Används för skildringar av det att hemlighålla eller inte offentliggöra sin transitionserfarenhet.

Queera nyutkomna
type: Concept
issued: 2022-05-19T10:12:00
modified: 2022-06-07T15:09:28
broader: Queera personer
in scheme: Queerlit
related: Outning
related: Nyutkomna lesbiska
related: Nyutkomna bögar
related: Nyutkomna bisexuella
related: Komma ut
related: Nyutkomna intersexpersoner
related: Nyutkomna transpersoner
scope note: Används för skildringar av personer som nyligen berättat för andra om, eller på annat sätt offentliggjort, att de är queera.

Björnar (identitet)
type: Concept
issued: 2022-05-19T10:12:00
modified: 2024-09-05T13:44:36
alternative label: Björnbögar
broader: Bögkultur
broader: Bögar
broader: Sexuell identitet
in scheme: Queerlit
narrower: Cubs
related: Könsuttryck
related: Chubs (identitet)
related: Uttrar (identitet)
related: Könsroller
scope note: Används för skildringar av personer som beskrivs som tillhörande björnsubkulturen. Subkulturen kännetecknas av kraftiga och håriga bögar.

Homosocialitet
type: Concept
issued: 2022-05-19T10:12:00
modified: 2022-05-19T10:12:00
hidden label: Homo-socialitet
in scheme: Queerlit
narrower: Kvinnors vänskap
narrower: Pojkars vänskap
narrower: Flickors vänskap
narrower: Mäns vänskap
related: Vänskap
related: Heterosocialitet
scope note: Används för skildringar av hur personer som liknar varandra skapar och upprätthåller relationer till varandra, ibland på bekostnad av dem som betraktas som annorlunda.
top concept of: Queerlit

Offentligt sex
type: Concept
issued: 2022-05-19T10:12:00
modified: 2022-05-19T10:12:00
broader: Sexuella praktiker
in scheme: Queerlit
related: Hbtqi-mötesplatser
related: Cruising
related: Bastuklubbar
related: Sexställen
related: Sexualitet
related: Exhibitionism
related: Sex på offentliga toaletter
scope note: Används för skildringar av sex på offentliga platser så som stränder, parker, offentliga toaletter med mera.

Hbtqi
type: Concept
issued: 2022-05-19T10:12:00
modified: 2023-12-06T09:24:17
broader: Hbtqi+
in scheme: Queerlit
narrower: Queer
related: Transgemenskaper
related: Böggemenskaper
related: Intersexgemenskaper
related: Queera gemenskaper
related: Lesbiska gemenskaper
related: Bisexuella gemenskaper
scope note: Används för skildringar med perspektiv eller teman som berör homosexualitet, bisexualitet, trans, queer och/eller intersex.

Sociala processer (hbtqi)
type: Concept
issued: 2022-05-19T10:12:00
modified: 2023-12-06T09:24:17
in scheme: Queerlit
narrower: Hbtqi-frigörelse
narrower: Skandaler (hbtqi)
narrower: Synlighet (hbtqi)
narrower: Könsförhållanden
related: Sexuell revolution
related: Skandaler (hbtqi)
related: Normalisering
scope note: Används för skildringar där förändring och utveckling av samhälliga strukturer, attityder och beteenden som är beroende av människors samspel har en framträdande betydelse för verket.
top concept of: Queerlit

Prostituerade
type: Concept
issued: 2022-05-19T10:12:00
modified: 2022-05-19T10:12:00
alternative label: Demimonder
alternative label: Eskorter
alternative label: Horor
alternative label: Kurtisaner
alternative label: Nattfjärilar
alternative label: Sexsäljare
broader: Sexarbetare (hbtqi)
in scheme: Queerlit
narrower: Prostituerade intersexpersoner
narrower: Prostituerade bisexuella
narrower: Prostituerade transpersoner
narrower: Prostituerade män
narrower: Prostituerade kvinnor
narrower: Prostituerade homosexuella
narrower: Gay for pay
narrower: Queera prostituerade
scope note: Används för skildringar av personer som säljer eller har sålt sexuella tjänster.

Polyamori
type: Concept
issued: 2022-05-19T10:12:00
modified: 2023-05-10T08:32:00
broader: Partnerpreferens
broader: Sexuella relationer
hidden label: Poly-amori
in scheme: Queerlit
narrower: Hierarkisk icke-monogami
narrower: Metamourer
related: Gruppsex
related: Sexuell identitet
related: Flersamt föräldraskap
related: Sexuellt samtycke
related: Flersamma relationer
scope note: Används för skildringar av att ha eller sträva efter att ha flera samtidiga kärleksrelationer med samtycke från alla inblandade.

Samlevnadsformer
type: Concept
issued: 2022-05-19T10:12:00
modified: 2023-12-06T09:24:17
in scheme: Queerlit
narrower: Frieri (hbtqi)
narrower: Samboförhållanden
narrower: Separationer (hbtqi)
narrower: Registrerade partnerskap
narrower: Äktenskap
narrower: Kollektiv (hbtqi)
related: Samboavtal
scope note: Används för skildringar av strukturen och sammansättningen av hushåll, inklusive antalet hushållsmedlemmar och deras relationer till varandra.
top concept of: Queerlit

Skällsord
type: Concept
issued: 2022-05-19T10:12:00
modified: 2022-05-19T10:12:00
in scheme: Queerlit
narrower: Flator
narrower: Fjollor
related: Förföljelse av hbtqi-personer
related: Trakasserier
related: Hbtqi-slang
related: Återvunna termer
related: Diskriminering av hbtqi-personer
scope note: Används för skildringar där kränkande och/eller diskriminerande uttryck, insinuationer eller öknamn används med avsikt att kränka en person, oftast med koppling till personens identitet. För att ett uttryck ska räknas som skällsord måste det vara nedsättande mot en viss person eller grupp, det måste användas för att underordna dem inom någon struktur av maktrelationer, och personen eller gruppen måste definieras av en föreställt inneboende egenskap (såsom etnicitet, sexuell läggning, könsidentitet etc.). Denna kategori innehåller termer som någon gång i historien ansetts vara skällsord. Därför kan vissa av dessa termer inte längre nödvändigtvis anses nedsättande, de kan vara vanliga i vardagligt språkbruk eller återtagna av gruppen de avses smäda.
top concept of: Queerlit

Analsex
type: Concept
issued: 2022-05-19T10:12:00
modified: 2022-05-19T10:12:00
alternative label: Rövsex
broader: Sexuella praktiker
broader: Sex
in scheme: Queerlit
narrower: Fistning
narrower: Rimming
narrower: Fingersex
narrower: Anala samlag
narrower: Bajssex
related: Analkulor
related: Buttpluggar
scope note: Används för skildringar av sexuella aktiviteter där anus stimuleras.

Äldre hbtqi-personer
type: Concept
issued: 2022-05-19T10:12:00
modified: 2024-03-19T10:00:33
alternative label: Gamla hbtqi-personer
alternative label: Hbtqi-seniorer
alternative label: Regnbågs-seniorer
alternative label: Äldre (hbtqi)
broader: Äldre
broader: Hbtqi-personer
in scheme: Queerlit
narrower: Äldre homosexuella
narrower: Äldre transpersoner
narrower: Äldre queera personer
narrower: Äldre intersexpersoner
narrower: Äldre bisexuella
related: Äldreboenden (hbtqi)
related: Gerontofili
scope note: Används för skildringar av hbtqi-personer som beskrivs som äldre - i regel över 65 år.

Lädergemenskaper
type: Concept
issued: 2022-05-19T10:12:00
modified: 2024-06-05T11:38:19
alternative label: Läderkulturen
alternative label: Läderscenen
broader: Hbtqi-gemenskaper
broader: Subkulturer
hidden label: Läder-gemenskaper
in scheme: Queerlit
narrower: Lädermän
narrower: Dominatrixer (hbtqi)
narrower: Masters (hbtqi)
narrower: Läderkvinnor
narrower: Läderfamiljer
related: SM
related: Gummisubkultur
scope note: Används för skildringar av gemenskaper som präglas av samhörighet kring fetischerande av klädsel i läder.

Dominanta (hbtqi)
type: Concept
issued: 2022-05-19T10:12:00
modified: 2023-12-13T10:57:15
broader: Sexuella roller
broader: Sexuell identitet
in scheme: Queerlit
narrower: Dominatrixer (hbtqi)
narrower: Masters (hbtqi)
related: Switchar (BDSM)
related: BDSM-gemenskaper
related: Sexslavar (hbtqi)
related: BDSM
related: Undergivna (hbtqi)
scope note: Används för skildringar av dominanta inom BDSM. Används för skildringar av dominanta där kopplingen till HBTQI har en framträdande betydelse.

Sex med händerna
type: Concept
issued: 2022-05-19T10:12:00
modified: 2022-05-19T10:12:00
alternative label: Handsex
broader: Sexuella praktiker
broader: Sex
in scheme: Queerlit
narrower: Fistning
narrower: Fingersex
narrower: Runka
narrower: Klittra
narrower: Nypning (sexualitet)
related: Onani
related: Erotisk massage
scope note: Används för skildringar av sexuella handlingar som utförs med händerna.

Queera relationer
type: Concept
issued: 2022-05-19T10:12:00
modified: 2022-10-26T08:10:16
broader: Relationer (hbtqi)
in scheme: Queerlit
related: Relationer mellan män
related: Bögrelationer
related: Transrelationer
related: Relationer mellan okönade personer
related: Relationer mellan kvinnor
related: Lesbiska relationer
related: Bisexuella relationer
related: Intersexrelationer
scope note: Används för skildringar av nära relationer mellan queera personer. Kan omfatta aspekter som släktskap, vänskap, sex eller kärlek.

Draggemenskaper
type: Concept
issued: 2022-05-19T10:12:00
modified: 2022-05-19T10:12:00
broader: Könsöverskridanden
broader: Hbtqi-gemenskaper
hidden label: Drag-gemenskaper
in scheme: Queerlit
narrower: Dragfamiljer
related: Ballroomkultur
related: Sexuell identitet
related: Dragqueens
related: Dragartister
related: Dragkings
related: Dragbaler
scope note: Används för skildringar av sociala gemenskaper där huvudsakligen dragartister och dragintresserade interagerar.

Juridik
type: Concept
issued: 2022-05-19T10:12:00
modified: 2024-06-05T11:38:19
alternative label: Lagar
alternative label: Lagstiftning
in scheme: Queerlit
narrower: Domstolsbeslut
narrower: Familjerätt (hbtqi)
narrower: Straffrätt
narrower: Diskrimineringslagstiftning
related: Papperslösa hbtqi-personer
related: Lobbning (hbtqi)
related: Rättsstatus
scope note: Används för skildringar där lagar och deras tillämpning har betydelse för verket.
top concept of: Queerlit

Rollbeteende
type: Concept
issued: 2022-05-19T10:12:00
modified: 2022-05-19T10:12:00
hidden label: Roll-beteende
in scheme: Queerlit
narrower: Sexuella roller
narrower: Könsroller
related: Sociala normer
related: Sexuell identitet
related: Butch-femme relationer
related: Rollspel (sexualitet)
related: Könsidentitet
scope note: Används för skildringar av beteenden beroende av normer, situationer, interna och externa förväntingar och social kontext.
top concept of: Queerlit

Transkvinnor
type: Concept
issued: 2022-05-19T10:12:00
modified: 2024-09-05T13:44:36
alternative label: M2F
alternative label: M2Fs
alternative label: Male-2-female
alternative label: Male-to-female
alternative label: Males transitioning to female
alternative label: Man-till-kvinna
alternative label: MtF
alternative label: MtF transsexuella
alternative label: MtFs
alternative label: Trans-kvinnor
alternative label: Transsexuella kvinnor
broader: Kvinnor
broader: Transpersoner
in scheme: Queerlit
narrower: Unga transkvinnor
narrower: Transflickor
narrower: Transmammor
narrower: Äldre transkvinnor
related: AMAB
related: Föräldrar till transkvinnor
related: Kvinnomän
scope note: Används för skildringar av kvinnor som vid födseln tilldelats det juridiska könet man.

Genusvetenskap
type: Concept
issued: 2022-05-19T10:12:00
modified: 2022-05-19T10:12:00
hidden label: Genus-vetenskap
in scheme: Queerlit
narrower: Bisexualitetsstudier
narrower: Transstudier
narrower: Homosexualitetsstudier
related: Queerteori
related: Sexualitet
related: Kön
related: Queerstudier
scope note: Används för skildringar av den akademiska disciplinen genusvetenskap som fokuserar på vilken roll kön och genus spelar i samhället.
top concept of: Queerlit

Sadism
type: Concept
issued: 2022-05-19T10:12:00
modified: 2022-05-19T10:12:00
broader: Sexuell preferens
broader: SM
broader: Fetischism (sexualitet)
in scheme: Queerlit
related: Dominatrixer (hbtqi)
related: BDSM-gemenskaper
related: Masters (hbtqi)
related: Bondage
related: BDSM
related: Sex
scope note: Används för skildringar av att njuta och bli upphetsad av att orsaka andra smärta, lidande och/eller förnedring.

Uteliv (hbtqi)
type: Concept
issued: 2022-05-19T10:12:00
modified: 2023-12-06T09:24:17
in scheme: Queerlit
narrower: Bastuklubbar
narrower: Hbtqi-klubbar
related: Hbtqi-mötesplatser
related: Hbtqi-barer
related: Litterära salonger (hbtqi)
related: Sexklubbar
related: Restauranger (hbtqi)
scope note: Används för skildringar av den sociala samvaron på i varierande grad offentliga mötesplatser för hbtqi-personer, främst under kvällar och nätter.
top concept of: Queerlit

Familjemedlemmar
type: Concept
issued: 2022-05-19T10:12:00
modified: 2022-05-19T10:12:00
alternative label: Nära anhöriga
in scheme: Queerlit
narrower: Partners (hbtqi)
narrower: Föräldrar (hbtqi)
narrower: Syskon
narrower: Barnbarn
narrower: Barn till hbtqi-personer
related: Relationer (hbtqi)
related: Hbtqi-familjer
scope note: Används för skildringar av personer som ingår i samma familj, oavsett biologiskt släktskap.
top concept of: Queerlit

Cispersoner
type: Concept
issued: 2022-05-19T10:12:00
modified: 2022-05-19T10:12:00
broader: Könsidentitet
hidden label: Cis-personer
in scheme: Queerlit
narrower: Ciskvinnor
narrower: Cismän
related: Kvinnor
related: Könsidentitet
related: Pansexuella
related: Transpersoner
related: Allierade
related: Män
scope note: Används för skildringar av personer vars kroppar, juridiska kön och könsidentiteter överensstämmer med det kön de tilldelades vid födseln. Motsats till transperson. Ämnesordet används för skildringar där identiteten som cisperson är i fokus.

Undergivna (hbtqi)
type: Concept
issued: 2022-05-19T10:12:00
modified: 2023-12-13T10:57:15
broader: Sexuella roller
broader: Sexuell identitet
in scheme: Queerlit
related: Dominatrixer (hbtqi)
related: Dominanta (hbtqi)
related: Switchar (BDSM)
related: BDSM-gemenskaper
related: Masters (hbtqi)
related: Sexslavar (hbtqi)
related: BDSM
scope note: Används för skildringar av undergivna inom BDSM. Används för skildringar av undergivna där kopplingen till HBTQI har en framträdande betydelse.

Queerstudier
type: Concept
issued: 2022-05-19T10:12:00
modified: 2023-03-29T10:53:01
alternative label: Queerforskning
hidden label: Queer-forskning
hidden label: Queer-studier
in scheme: Queerlit
related: Bisexualitetsstudier
related: Queerteori
related: Transstudier
related: Homosexualitetsstudier
related: Genusvetenskap
related: Lesbiska studier
related: Bögstudier
scope note: Används för skildringar av forskning om sexualitet och könsidentitet utifrån ett queerteoretiskt perspektiv.
top concept of: Queerlit

Flersamma relationer
type: Concept
issued: 2023-05-10T08:32:00
modified: 2023-05-10T08:32:00
alternative label: Flersamma förhållanden
alternative label: Icke-monogama förhållanden
alternative label: Icke-monogama relationer
alternative label: Ickemonogama förhållanden
alternative label: Ickemonogama relationer
alternative label: Öppna förhållanden
alternative label: Öppna relationer
broader: Partnerpreferens
broader: Relationspreferens
broader: Sexuella relationer
in scheme: Queerlit
narrower: Polygami
related: Polyamori
related: Gruppsex
related: Sexuell identitet
related: Flersamt föräldraskap
related: Sexuellt samtycke
scope note: Används för skildringar av romantiska eller sexuella relationer med flera personer inblandade.

Hbtqi-mötesplatser
type: Concept
issued: 2022-05-19T10:12:00
modified: 2023-12-06T09:24:17
in scheme: Queerlit
related: Hbtqi-barer
related: Cruising
related: Sexställen
related: Hbtqi-evenemang
related: Badplatser (hbtqi)
related: Offentliga hygieninrättningar
related: Uteliv (hbtqi)
related: Offentligt sex
scope note: Används för skildringar av formella och informella mötesplatser för hbtqi-personer.
top concept of: Queerlit

Kärlek (hbtqi)
type: Concept
issued: 2022-05-19T10:12:00
modified: 2023-12-06T09:24:17
alternative label: Kärleksrelationer (hbtqi)
broader: Känslor (hbtqi)
in scheme: Queerlit
narrower: Obesvarad kärlek (hbtqi)
narrower: Kär i kompis (hbtqi)
narrower: Platonisk kärlek (hbtqi)
narrower: Kärlek mellan kvinnor
narrower: Kärlek mellan okönade personer
narrower: Förälskelse (hbtqi)
narrower: Kärlek mellan män
related: Relationer (hbtqi)
related: Kärlekstrianglar
scope note: Används för skildringar av känslospektrum som präglas av ömhet, tillgivenhet, samhörighet och njutning och som involverar hbtqi-personer som objekt och/eller subjekt.

Hbtqi-fobi
type: Concept
issued: 2022-05-19T10:12:00
modified: 2023-12-06T09:24:17
in scheme: Queerlit
narrower: Bifobi
narrower: Homofobi
narrower: Transfobi
narrower: Intersexfobi
narrower: Queerfobi
related: Självförtryck (hbtqi)
related: Hiv-/aidsfobi
related: Mobbning
scope note: Används för skildringar av rädsla, avsky eller hat gentemot hbtqi-personer eller de som antas vara hbtqi-personer.
top concept of: Queerlit

Sexarbetare (hbtqi)
type: Concept
issued: 2022-05-19T10:12:00
modified: 2023-12-06T09:24:17
in scheme: Queerlit
narrower: Prostituerade
narrower: Strippor
narrower: Porrskådespelare
narrower: Internetsexarbetare (hbtqi)
narrower: Telefonsexarbetare
related: Erotisk massage
related: Sexköpare
related: Sexindustri
scope note: Används för skildringar av hbtqi-personer, eller personer som utför samkönat sex, som utför sexarbete så som försäljning av sexuella tjänster eller upphetsande sceniska framträdanden.
top concept of: Queerlit

Transmän
type: Concept
issued: 2022-05-19T10:12:00
modified: 2024-09-05T13:44:36
alternative label: F2M
alternative label: F2Ms
alternative label: Female-2-male
alternative label: Female-to-male
alternative label: Females transitioning to males
alternative label: FtM
alternative label: FtM transsexuella
alternative label: FtMs
alternative label: Kvinna-till-man
alternative label: Trans-män
alternative label: Transsexuella män
broader: Transpersoner
broader: Män
in scheme: Queerlit
narrower: Unga transmän
narrower: Transpappor
narrower: Transpojkar
narrower: Äldre transmän
related: Föräldrar till transmän
related: AFAB
related: Binding (bröstkorg)
related: Mankvinnor
scope note: Används för skildringar av män som vid födseln tilldelats det juridiska könet kvinna.

Hbtqi+
type: Concept
issued: 2022-05-19T10:12:00
modified: 2023-12-06T09:24:17
in scheme: Queerlit
narrower: Hbtqi
related: Transgemenskaper
related: Asexualitet
related: Böggemenskaper
related: Intersexgemenskaper
related: Queera gemenskaper
related: Lesbiska gemenskaper
related: Bisexuella gemenskaper
scope note: Används för skildringar med perspektiv eller teman som berör homosexualitet, bisexualitet, trans, queer, intersex och/eller andra brott mot hetero- och cisnormer.
top concept of: Queerlit

Dominatrixer (hbtqi)
type: Concept
issued: 2022-05-19T10:12:00
modified: 2023-12-06T09:24:17
broader: Sexuella roller
broader: Lädergemenskaper
broader: Dominanta (hbtqi)
broader: Sexuell identitet
in scheme: Queerlit
related: BDSM-gemenskaper
related: Masters (hbtqi)
related: Sexslavar (hbtqi)
related: BDSM
related: Sadism
related: Undergivna (hbtqi)
scope note: Används för skildringar av en kvinnlig dominerande part i en hbtqi-relevant BDSM-kontext.

Diskretion (hbtqi)
type: Concept
issued: 2022-05-19T10:12:00
modified: 2023-12-06T09:24:17
alternative label: Hemlighållande (hbtqi)
in scheme: Queerlit
related: Outning
related: Komma ut
related: Garderobsbisexuella
related: Ryktesspridning (hbtqi)
related: Garderobsbögar
related: Garderobslesbiska
related: Hemlighetssymbolik (hbtqi)
related: Stealth (transpersoner)
scope note: Används för skildringar av strävan efter att hemlighålla och/eller inte dra till sig uppmärksamhet på grund av sin sexuella läggning eller könsidentitet.
top concept of: Queerlit

Heterosexuella
type: Concept
issued: 2022-05-19T10:12:00
modified: 2022-05-19T10:12:00
in scheme: Queerlit
narrower: Heterosexuella barn
narrower: Heterosexuella kvinnor
narrower: Heterosexuella män
narrower: Unga heterosexuella
narrower: Äldre heterosexuella
related: Allosexualitet
related: Allierade
related: Heterosexualitet
scope note: Används för skildringar av personer som beskrivs som heterosexuella. Ämnesordet används för skildringar där identiteten som heterosexuell är i fokus.
top concept of: Queerlit

SM
type: Concept
issued: 2022-05-19T10:12:00
modified: 2022-05-19T10:12:00
alternative label: Algolagni
alternative label: S&M
alternative label: S/M
alternative label: Sadomasochism
broader: BDSM
in scheme: Queerlit
narrower: Prygel
narrower: Masochism
narrower: Sadism
narrower: Smiskning
related: Lädergemenskaper
related: Sexslavar (hbtqi)
related: Gummisex
related: Läderfamiljer
related: SM-rörelser
scope note: Används för skildringar av sexuella praktiker som innefattar tillfogande och upplevande av smärta.

Barn
type: Concept
issued: 2022-05-19T10:12:00
modified: 2022-05-19T10:12:00
in scheme: Queerlit
narrower: Heterosexuella barn
narrower: Flickor
narrower: Pojkar
narrower: Okönade barn
narrower: Hbtqi-barn
related: Ungdomar
related: Barnlängtan
related: Barns sexualitet
scope note: Används för skildringar av personer som beskrivs som barn - i regel personer under 15 år.
top concept of: Queerlit

Transrelationer
type: Concept
issued: 2022-05-19T10:12:00
modified: 2022-10-26T08:10:16
broader: Könsöverskridanden
broader: Relationer (hbtqi)
hidden label: Trans-relationer
in scheme: Queerlit
related: Relationer mellan män
related: Bögrelationer
related: Queera relationer
related: Relationer mellan okönade personer
related: Relationer mellan kvinnor
related: Lesbiska relationer
related: Bisexuella relationer
related: Intersexrelationer
scope note: Används för skildringar av nära relationer mellan transpersoner. Kan omfatta aspekter som släktskap, vänskap, sex eller kärlek.

Masters (hbtqi)
type: Concept
issued: 2022-05-19T10:12:00
modified: 2023-12-06T09:24:17
broader: Sexuella roller
broader: Lädergemenskaper
broader: Dominanta (hbtqi)
broader: Sexuell identitet
in scheme: Queerlit
related: Dominatrixer (hbtqi)
related: BDSM-gemenskaper
related: Sexslavar (hbtqi)
related: BDSM
related: Sadism
related: Undergivna (hbtqi)
scope note: Används för skildringar av en manligt identifierad dominerande part i en BDSM-kontext.

Relationspreferens
type: Concept
issued: 2022-05-19T10:12:00
modified: 2023-05-10T08:32:00
hidden label: Relations-preferens
in scheme: Queerlit
narrower: Monogami
narrower: Flersamma relationer
related: Interkulturella relationer
related: Relationer (hbtqi)
related: Intergenerationella relationer
related: Könsidentitet
related: Sexuella relationer
related: Sexuell läggning
scope note: Används för skildringar av personers preferens vad gäller relationsformer, exempelvis avseende antalet ingående partners.
top concept of: Queerlit

Feminism
type: Concept
issued: 2022-05-19T10:12:00
modified: 2022-05-19T10:12:00
in scheme: Queerlit
narrower: Heterofeminism
narrower: Ekofeminism
narrower: Radikalfeminism
narrower: Lesbisk feminism
narrower: Första vågens feminism
narrower: Andra vågens feminism
related: Kvinnor
related: Kvinnorörelser
scope note: Används för skildringar av de rörelser som syftar till att definiera, etablera och försvara jämlika politiska, ekonomiska och sociala rättigheter och möjligheter för kvinnor.
top concept of: Queerlit

Hiv/aids
type: Concept
issued: 2022-05-19T10:12:00
modified: 2022-05-19T10:12:00
alternative label: Acquired immune deficiency syndrome
alternative label: Aids
alternative label: Förvärvat immunbristsyndrom
alternative label: HTLV-III
alternative label: Hiv
alternative label: Hiv och aids
alternative label: Humant immunbristvirus
broader: Könssjukdomar
in scheme: Queerlit
related: Personer som lever med hiv
related: Par med olika hivstatus
related: Aids-minnesmärken
related: PrEP
related: Kompisvård (hbtqi)
related: Hiv-/aidsfobi
related: Hiv-/aidsaktivister
related: Personer som lever med välbehandlad hiv
related: Medvetenhet om hiv/aids
scope note: Används för skildringar av infektioner orsakade av hivviruset, som obehandlade kan leda till det tillstånd av försvagat immunsystem som kallas aids.

Diskriminering av hbtqi-personer
type: Concept
issued: 2022-05-19T10:12:00
modified: 2023-12-06T09:24:17
in scheme: Queerlit
related: Intolerans mot hbtqi-personer
related: Skällsord
related: Polistrakasserier
related: Förföljelse av hbtqi-personer
related: Trakasserier
related: Homofobi
related: Rasism (hbtqi)
related: Diskrimineringslagstiftning
scope note: Används för skildringar av diskriminering, åtskillnad mellan olika människor som inte bygger på meriter eller talanger, av hbtqi-personer på grund av deras sexuella läggning och/eller könsidentitet eller könsuttryck.
top concept of: Queerlit

Konst (hbtqi)
type: Concept
issued: 2022-05-19T10:12:00
modified: 2023-12-06T09:24:17
in scheme: Queerlit
narrower: Dragshower
narrower: Teater (hbtqi)
related: Körer (hbtqi)
related: Skådespelare (hbtqi)
related: Dragartister
related: Artister (hbtqi)
related: Musiker (hbtqi)
related: Voguing
scope note: Används för skildringar av konst där kopplingen till hbtqi har en framträdande betydelse.
top concept of: Queerlit

Subkulturer
type: Concept
issued: 2022-05-19T10:12:00
modified: 2023-01-04T14:56:09
in scheme: Queerlit
narrower: Bögkultur
narrower: Lädergemenskaper
narrower: Lesbisk kultur
narrower: Ballroomkultur
narrower: Dekadens
narrower: Dandyism
narrower: Transkultur
narrower: Gummisubkultur
scope note: Används för skildringar av grupper av personer som finner samhörighet inom gruppen och som skiljer sig från den större gruppen eller samhället de tillhör. En subkultur kan utgöras av personer med samma sexuella läggning, sexuella preferenser, religion, politiska åsikter, kultursmak med mera.
top concept of: Queerlit

Hbtqi-barn
type: Concept
issued: 2022-05-19T10:12:00
modified: 2023-12-06T09:24:17
broader: Barn
broader: Hbtqi-personer
in scheme: Queerlit
narrower: Barn utsatta för sexuella övergrepp (hbtqi)
narrower: Transbarn
narrower: Homosexuella barn
narrower: Bisexuella barn
narrower: Intersexbarn
narrower: Queera barn
related: Föräldrar (hbtqi)
related: Föräldrar till hbtqi-personer
scope note: Används för skildringar av barn som beskrivs som homosexuella, bisexuella, transpersoner, queera och/eller intersexpersoner.

Ickebinära personer
type: Concept
issued: 2022-05-19T10:12:00
modified: 2022-11-23T07:43:01
alternative label: Enbies
alternative label: Icke-binära personer
alternative label: Ickebinäris
alternative label: NB-ies
broader: Transpersoner
in scheme: Queerlit
narrower: Ickebinära barn
narrower: Unga ickebinära
narrower: Äldre ickebinära
related: Föräldrar till ickebinära personer
related: MtX
related: Okönade personer
related: FtX
related: Androgyna personer
related: Agenderpersoner
scope note: Används för skildringar av personer som beskrivs som ickebinära, vilket innebär att identifiera sig mellan, bortom eller både som man och kvinna.

Hbtqi-ungdomar
type: Concept
issued: 2022-05-19T10:12:00
modified: 2023-12-06T09:24:17
alternative label: Hbtqi-tonåringar
alternative label: Unga hbtqi-personer
broader: Hbtqi-personer
broader: Ungdomar
in scheme: Queerlit
narrower: Unga transpersoner
narrower: Hemlösa hbtqi-ungdomar
narrower: Queera ungdomar
narrower: Unga bisexuella
narrower: Unga homosexuella
narrower: Unga intersexpersoner
related: Efebofili
related: Unga heterosexuella
scope note: Används för skildringar av personer som beskrivs som ungdomar - i regel mellan 15 och 25 år - och som homosexuella, bisexuella, transpersoner, queera och/eller intersexpersoner.

Män
type: Concept
issued: 2022-05-19T10:12:00
modified: 2022-05-19T10:12:00
broader: Könsidentitet
in scheme: Queerlit
narrower: Transmän
narrower: Bögar
narrower: Bisexuella män
narrower: Heterosexuella män
narrower: Cismän
narrower: Män som har sex med män
related: Kvinnor
related: Transpersoner
related: Cispersoner
scope note: Används för skildringar av personer som beskrivs som män.

Hbtqi-aktivism
type: Concept
issued: 2022-05-19T10:12:00
modified: 2024-09-05T13:44:36
in scheme: Queerlit
narrower: Icke-våld (hbtqi)
narrower: Civil olydnad (hbtqi)
narrower: Outning
narrower: Lobbning (hbtqi)
narrower: Aktionskampanjer (hbtqi)
narrower: Demonstrationer (hbtqi)
narrower: Allierade
narrower: Självförsvar (hbtqi)
related: Hbtqi-aktivister
scope note: Används för skildringar av aktivism med fokus på hbtqi-personers rättigheter och levnadsvillkor.
top concept of: Queerlit

Våld mot hbtqi-personer
type: Concept
issued: 2022-05-19T10:12:00
modified: 2023-12-06T09:24:17
alternative label: Bögknackning
alternative label: Gay bashing
alternative label: Våld mot bisexuella
alternative label: Våld mot bögar
alternative label: Våld mot homosexuella
alternative label: Våld mot intersexpersoner
alternative label: Våld mot lesbiska
alternative label: Våld mot queera
alternative label: Våld mot transpersoner
hidden label: Gay-bashing
hidden label: Gaybashing
in scheme: Queerlit
narrower: Våld i nära relationer (hbtqi)
narrower: Mord på hbtqi-personer
related: Förföljelse av hbtqi-personer
related: Offer för sexuella övergrepp (hbtqi)
related: Sexuella trakasserier
related: Homofobi
related: Hatbrottsoffer (hbtqi)
related: Sexuellt våld
related: Våldtäktsoffer (hbtqi)
scope note: Används för skildringar av våld mot homosexuella, bisexuella, transpersoner, queera och/eller intersexpersoner.
top concept of: Queerlit

Hbtqi-evenemang
type: Concept
issued: 2022-05-19T10:12:00
modified: 2023-12-06T09:24:17
in scheme: Queerlit
narrower: Hbtqi-sportevenemang
narrower: Kvinnomusikfestivaler
narrower: Halloween (hbtqi)
narrower: Dyke march
narrower: Melodifestivaler (hbtqi)
narrower: Dragbaler
narrower: Trans march
narrower: Pride
related: Hbtqi-mötesplatser
scope note: Används för skildringar av evenemang för och/eller anordnade av hbtqi-personer.
top concept of: Queerlit

Rättsstatus
type: Concept
issued: 2022-05-19T10:12:00
modified: 2022-05-19T10:12:00
in scheme: Queerlit
narrower: Asylrätt (hbtqi)
narrower: Föräldrarätt
narrower: Frihetsberövande av hbtqi-personer
narrower: Officiell dokumentation
related: Papperslösa hbtqi-personer
related: Registrerade partnerskap
related: Juridik
related: Flyktingar (hbtqi)
related: Civilstånd
scope note: Används för skildringar där personers relation till juridiska regelverk som reglerar personliga rättigheter har betydelse för verket.
top concept of: Queerlit

Erogena zoner
type: Concept
issued: 2022-05-19T10:12:00
modified: 2022-05-19T10:12:00
alternative label: Erogena kroppsdelar
in scheme: Queerlit
narrower: Vulvor
narrower: Testiklar
narrower: Klitoris
narrower: Bröst
narrower: Penisar
narrower: Skinkor
narrower: Vaginor
related: Könsorgan
related: Partialism
scope note: Används för skildringar av områden på kroppen som är känsliga för sexuell beröring.
top concept of: Queerlit

Heterosexism
type: Concept
issued: 2022-05-19T10:12:00
modified: 2022-05-19T10:12:00
hidden label: Hetero-sexism
in scheme: Queerlit
related: Bifobi
related: Homofobi
related: Transfobi
related: Sexism
related: Intersexfobi
related: Lesbofobi
related: Ex-gayrörelser
related: Queerfobi
related: Heterosexualitet
scope note: Används för skildringar av ett samhälles strukturella antagande att alla människor är heterosexuella.
top concept of: Queerlit

Hbtqi-gemenskaper
type: Concept
issued: 2022-05-19T10:12:00
modified: 2023-12-06T09:24:17
alternative label: Hbtqi-communities
alternative label: Hbtqi-community
in scheme: Queerlit
narrower: Homosexuella gemenskaper
narrower: Transgemenskaper
narrower: Lädergemenskaper
narrower: BDSM-gemenskaper
narrower: Intersexgemenskaper
narrower: Draggemenskaper
narrower: Queera gemenskaper
narrower: Bisexuella gemenskaper
narrower: Kollektiv (hbtqi)
scope note: Används för skildringar av sociala gemenskaper där huvudsakligen hbtqi-personer interagerar.
top concept of: Queerlit

Hbtqi-rörelser
type: Concept
issued: 2022-05-19T10:12:00
modified: 2023-12-06T09:24:17
alternative label: Hbtqi-organisationer
alternative label: Organisationer för hbtqi-personer
broader: Sociala rörelser
in scheme: Queerlit
narrower: Transrörelser
narrower: Bisexuella rörelser
narrower: Queerrörelser
narrower: Intersexrörelser
narrower: Homosexuella rörelser
related: Medborgerliga rättigheter (hbtqi)
related: Hbtqi-frigörelse
related: Sexualpolitiska organisationer
related: Hiv-/aidsaktivister
related: Pride
scope note: Används för skildringar av sociala rörelser med fokus på hbtqi-personers rättigheter och levnadsvillkor.

Känslor (hbtqi)
type: Concept
issued: 2022-05-19T10:12:00
modified: 2023-12-06T09:24:17
in scheme: Queerlit
narrower: Sorg (hbtqi)
narrower: Kärlek (hbtqi)
narrower: Intimitet (hbtqi)
narrower: Begär (hbtqi)
narrower: Könseufori
narrower: Svartsjuka (hbtqi)
related: Megasexualitet
related: Demisexuella
related: Megasexuella
scope note: Används för skildringar av generella känslor som involverar hbtqi-personer som objekt och/eller subjekt.
top concept of: Queerlit

Crossdressing
type: Concept
issued: 2022-05-19T10:12:00
modified: 2022-09-12T08:21:55
alternative label: Crossdressers
broader: Könsuttryck
broader: Könsöverskridanden
in scheme: Queerlit
narrower: Maskuliniserande crossdressing
narrower: Feminiserande crossdressing
related: Kläder
related: Underkläder
related: Transvestism
related: Kabuki
related: Dragqueens
related: Dragartister
related: Dragkings
related: Eonism
scope note: Används för skildringar av personer som, tillfälligt eller långvarigt och oavsett anledning, bär kläder som associeras med ett annat kön än det de identifierar sig som. För skildringar av personer som beskrivs som transvestiter, använd ämnesordet "Transvestiter".

BDSM-gemenskaper
type: Concept
issued: 2022-05-19T10:12:00
modified: 2022-05-19T10:12:00
alternative label: BDSM-community
broader: Hbtqi-gemenskaper
in scheme: Queerlit
narrower: Läderfamiljer
related: Dominatrixer (hbtqi)
related: Dominanta (hbtqi)
related: Switchar (BDSM)
related: Masters (hbtqi)
related: Bondage
related: BDSM
related: Masochism
related: Sadism
related: Undergivna (hbtqi)
related: SM-rörelser
scope note: Används för skildringar av sociala gemenskaper där huvudsakligen BDSM-utövare interagerar.

Sexställen
type: Concept
issued: 2022-05-19T10:12:00
modified: 2023-03-29T10:53:01
alternative label: Sexplatser
hidden label: Sex-platser
hidden label: Sex-ställen
in scheme: Queerlit
narrower: Bastuklubbar
narrower: Offentliga toaletter
narrower: Sexklubbar
narrower: Sexfester
narrower: Dark rooms
related: Hbtqi-mötesplatser
related: Anonymt sex
related: Sexualitet
related: Sex
related: Offentligt sex
scope note: Används för skildringar där specifika platser för vanligt förekommande sexuella möten besöks.
top concept of: Queerlit

Familjerätt (hbtqi)
type: Concept
issued: 2022-05-19T10:12:00
modified: 2023-12-06T09:24:17
broader: Juridik
in scheme: Queerlit
narrower: Juridiskt namn
narrower: Äktenskapslagstiftning
narrower: Namnändring
related: Samboavtal
related: Föräldrarätt
related: Officiell dokumentation
related: Registrerade partnerskap
related: Närståendeadoption
related: Donatorer (medicin)
related: Vuxenadoption
related: Adoption (hbtqi)
scope note: Används för skildringar där den del av juridiken som avhandlar familjeförhållanden - inklusive samboskap, äktenskap, adoption, relationer mellan föräldrar och barn, skilsmässa och vårdnad om barn - har en framträdande betydelse för verket.

Kvinnor
type: Concept
issued: 2022-05-19T10:12:00
modified: 2022-05-19T10:12:00
broader: Könsidentitet
in scheme: Queerlit
narrower: Kvinnor som har sex med kvinnor
narrower: Ciskvinnor
narrower: Amasoner
narrower: Heterosexuella kvinnor
narrower: Lesbiska
narrower: Bisexuella kvinnor
narrower: Transkvinnor
related: Feminism
related: Transpersoner
related: Cispersoner
related: Män
scope note: Används för skildringar av personer som beskrivs som kvinnor.

Skaffa barn (hbtqi)
type: Concept
issued: 2022-05-19T10:12:00
modified: 2023-12-06T09:24:17
alternative label: Familjeplanering (hbtqi)
in scheme: Queerlit
narrower: IVF
narrower: Graviditet (hbtqi)
narrower: Inseminering
narrower: Adoption (hbtqi)
narrower: Surrogatskap
related: Föräldrar (hbtqi)
related: Spermadonatorer
related: Hbtqi-familjer
related: Äggdonatorer
related: Barnlängtan
scope note: Används för skildringar av hbtqi-personer som planerar för att skaffa barn.
top concept of: Queerlit

Dragartister
type: Concept
issued: 2022-05-19T10:12:00
modified: 2023-04-05T12:12:25
alternative label: Drag
alternative label: Dragshowartister
broader: Könsöverskridanden
broader: Artister (hbtqi)
hidden label: Drag-artister
in scheme: Queerlit
narrower: Dragqueens
narrower: Dragkings
related: Kläder
related: Könsuttryck
related: Crossdressing
related: Draggemenskaper
related: Camp
related: Konst (hbtqi)
related: Dragshower
related: Dragbaler
scope note: Används för skildringar av personer som ikläder sig manligt eller kvinnligt kodade attribut, ofta i överdriven tappning, i underhållningssyfte och/eller som uttryck för en subkultur präglad av experimentella eller parodierande könsuttryck.

Kön
type: Concept
issued: 2022-05-19T10:12:00
modified: 2022-05-19T10:12:00
alternative label: Genus
in scheme: Queerlit
narrower: Könsuttryck
narrower: Biologiskt kön
narrower: Juridiskt kön
narrower: Könsidentitet
related: Genusvetenskap
related: Passera (kön)
related: Genderbending
related: Könsbekräftande behandling
related: Könsförhållanden
related: Stealth (transpersoner)
scope note: Används för skildringar av kön, en mångfacetterad kategorisering för gruppindelning efter biologiska, juridiska, sociala, och/eller identitetsmässiga faktorer. Detta övergripande ämnesord används om verk där flera av dessa aspekter har en framträdande betydelse i verket.
top concept of: Queerlit

Etniska grupper (hbtqi)
type: Concept
issued: 2022-05-19T10:12:00
modified: 2023-12-06T09:24:17
alternative label: Folkgrupper (hbtqi)
broader: Hbtqi-personer
in scheme: Queerlit
narrower: Asiater (hbtqi)
narrower: Vita hbtqi-personer
narrower: Judendom (hbtqi)
narrower: Icke-vita hbtqi-personer
narrower: Latines (hbtqi)
narrower: Romer (hbtqi)
narrower: Svarta hbtqi-personer
related: Papperslösa hbtqi-personer
related: Ursprungsbefolkningar (hbtqi)
related: Rasism (hbtqi)
related: Migranter (hbtqi)
scope note: Används för skildringar av hbtqi-personer som ingår i grupper med gemensam historia, samhörighet och olika aspekter av kultur, t.ex. språk, religion och traditioner. För skildringar där fokus ligger på migrationserfarenheter används även ämnesordet "Migranter (hbtqi)".

Adoption (hbtqi)
type: Concept
issued: 2022-05-19T10:12:00
modified: 2023-12-06T09:24:17
broader: Skaffa barn (hbtqi)
in scheme: Queerlit
narrower: Närståendeadoption
narrower: Vuxenadoption
related: Föräldrar (hbtqi)
related: Familjerätt (hbtqi)
related: Adoptivföräldrar (hbtqi)
related: Fosterfamiljer (hbtqi)
related: Barn till hbtqi-personer
related: Biologiska föräldrar (hbtqi)
related: Hbtqi-familjer
related: Adoptivfamiljer (hbtqi)
related: Adopterade (hbtqi)
scope note: Används för skildringar av adoption där de biologiska föräldrarna, adoptivföräldrarna och/eller den/de adopterade är hbtqi-personer.

Religion (hbtqi)
type: Concept
issued: 2022-05-19T10:12:00
modified: 2023-12-06T09:24:17
alternative label: Gudstro (hbtqi)
alternative label: Tro (hbtqi)
alternative label: Troende (hbtqi)
alternative label: Trosriktningar (hbtqi)
in scheme: Queerlit
narrower: Islam (hbtqi)
narrower: Afrikanska religioner (hbtqi)
narrower: Judendom (hbtqi)
narrower: Asiatiska religioner (hbtqi)
narrower: Kristendom (hbtqi)
narrower: Schamanism (hbtqi)
narrower: Amerikanska ursprungsreligioner (hbtqi)
narrower: Paganism (hbtqi)
related: Ateism (hbtqi)
related: Religiösa ledare (hbtqi)
related: Andlighet (hbtqi)
scope note: Används för skildringar av religion där kopplingen till hbtqi har en framträdande betydelse, antingen genom att de troende beskrivs som hbtqi-personer, genom beskrivningar av hbtqi-personers förhållningssätt till religion eller genom andra troendes förhållningssätt till hbtqi.
top concept of: Queerlit

Hbtqi-par
type: Concept
issued: 2022-05-19T10:12:00
modified: 2023-12-06T09:24:17
broader: Relationer (hbtqi)
broader: Hbtqi-personer
in scheme: Queerlit
narrower: Gifta hbtqi-par
narrower: Transpar
narrower: Par med olika hivstatus
narrower: Bostonäktenskap
narrower: Ogifta hbtqi-par
narrower: Homosexuella par
narrower: Bisexuella par
narrower: Queera par
narrower: Intersexpar
related: Partners (hbtqi)
related: Samboförhållanden
scope note: Används för skildringar av parrelationer mellan hbtqi-personer.

Föräldrar till hbtqi-personer
type: Concept
issued: 2022-05-19T10:12:00
modified: 2023-12-06T09:24:17
alternative label: Hbtqi-personers föräldrar
broader: Föräldrar (hbtqi)
in scheme: Queerlit
narrower: Pappor till hbtqi-personer
narrower: Föräldrar till transpersoner
narrower: Föräldrar till homosexuella
narrower: Mammor till hbtqi-personer
narrower: Föräldrar till queera personer
narrower: Föräldrar till bisexuella
narrower: Föräldrar till intersexpersoner
related: Adoptivföräldrar (hbtqi)
related: Hbtqi-personer
related: Hbtqi-barn
related: Biologiska föräldrar (hbtqi)
related: Fosterföräldrar (hbtqi)
scope note: Används för skildringar av föräldrar till hbtqi-personer, oavsett biologiskt släktskap.

Könsbekräftande behandling
type: Concept
issued: 2022-05-19T10:12:00
modified: 2022-05-19T10:12:00
alternative label: Könsbekräftande ingrepp
alternative label: Könsbekräftande kirurgi
alternative label: Könskorrigerande behandling
alternative label: Könskorrigering
broader: Könsöverskridanden
broader: Hälso- och sjukvård (hbtqi)
in scheme: Queerlit
narrower: Underlivskirurgi (transpersoner)
narrower: Bröstförstoring
narrower: Mastektomi
narrower: Röstträning (transpersoner)
narrower: Hormonbehandling (kön)
narrower: Hårborttagning
related: Könsidentitetsutredning
related: Transsexuella
related: Kön
related: Transitionering
related: Transpersoner
scope note: Används för skildringar av medicinsk och/eller kirurgisk behandling som genomförs för att få kroppen att bättre stämma överens med ens könsidentitet.

Sexuella roller
type: Concept
issued: 2022-05-19T10:12:00
modified: 2022-05-19T10:12:00
broader: Sexuell preferens
broader: Sexuell identitet
broader: Rollbeteende
in scheme: Queerlit
narrower: Lädermammor
narrower: Dominatrixer (hbtqi)
narrower: Dominanta (hbtqi)
narrower: Switchar (BDSM)
narrower: Masters (hbtqi)
narrower: Sexslavar (hbtqi)
narrower: Läderpappor
narrower: Undergivna (hbtqi)
related: Sexuell identitet
related: Sexualitet
related: Rollspel (sexualitet)
scope note: Används för skildringar av erotiska identiteter som personer antar under sexuell lek med en eller flera personer, som antingen kan begränsas till sexuella aktiviteter eller utvidgas till det dagliga livet.

Fetischism (sexualitet)
type: Concept
issued: 2022-05-19T10:12:00
modified: 2024-03-19T10:00:33
alternative label: Fetischism
alternative label: Sexuell fetischism
broader: Sexuell preferens
in scheme: Queerlit
narrower: Efebofili
narrower: Vampyrism (sexualitet)
narrower: Masochism
narrower: Gerontofili
narrower: Sadism
narrower: Exhibitionism
narrower: Partialism
narrower: Voyeurism
related: Urinsex
related: Sexuell identitet
related: Autoerotisk kvävning
related: BDSM
related: Sexuellt samtycke
scope note: Används för skildringar av sexuell attraktion riktad mot föremål, egenskaper eller kroppsdelar som vanligtvis inte uppfattas som upphetsande.

Komma ut
type: Concept
issued: 2022-05-19T10:12:00
modified: 2024-09-05T13:44:36
in scheme: Queerlit
related: Diskretion (hbtqi)
related: Outning
related: Nyutkomna lesbiska
related: Nyutkomna bögar
related: Nyutkomna bisexuella
related: Garderobsbisexuella
related: Garderobsbögar
related: Garderobslesbiska
related: Nyutkomna intersexpersoner
related: Nyutkomna transpersoner
related: Stealth (transpersoner)
related: Queera nyutkomna
scope note: Används för skildringar av att berätta om eller offentliggöra sin sexuella läggning, sitt könsuttryck eller sin könsidentitet i sammanhang där detta inte tidigare varit känt eller erkänt.
top concept of: Queerlit

Sexindustri
type: Concept
issued: 2022-05-19T10:12:00
modified: 2023-03-29T10:53:01
alternative label: Sexbranschen
alternative label: Sexindustrin
hidden label: Sex-industri
in scheme: Queerlit
narrower: Bordeller
narrower: Striptease
narrower: Sexbutiker
narrower: Sexturism
narrower: Sexklubbar
narrower: Porrindustri
narrower: Porrbiografer
related: Sexarbetare (hbtqi)
related: Bastuklubbar
related: Sexualitet
related: Sexarbete
related: Telefonsex
scope note: Används för skildringar av den industri där sexuella handlingar och tjänster utförs i utbyte mot pengar eller gåvor.
top concept of: Queerlit

Sexuella relationer
type: Concept
issued: 2022-05-19T10:12:00
modified: 2023-05-10T08:32:00
broader: Relationer (hbtqi)
in scheme: Queerlit
narrower: Polyamori
narrower: Monogami
narrower: Tillfälligt sex
narrower: Kärlekstrianglar
narrower: Flersamma relationer
related: Partnerpreferens
related: Sexuell preferens
related: Anonymt sex
related: Relationspreferens
related: Megasexualitet
related: Demisexuella
related: Älskare (hbtqi)
related: Megasexuella
scope note: Används för skildringar av relationer mellan två eller flera personer där sex är en central aspekt.

Sexuellt samtycke
type: Concept
issued: 2022-05-19T10:12:00
modified: 2023-05-10T08:32:00
alternative label: Samtycke
alternative label: Sexuell frivillighet
in scheme: Queerlit
related: Sexuella övergrepp (hbtqi)
related: Polyamori
related: Våld i nära relationer (hbtqi)
related: Offer för sexuella övergrepp (hbtqi)
related: Fetischism (sexualitet)
related: Bondage
related: Våldtäktsoffer (hbtqi)
related: Sexuella praktiker
related: BDSM
related: Sexuell myndighetsålder
related: Sex
related: Flersamma relationer
scope note: Används för skildringar där det att en person frivilligt går med på en annans förslag eller önskemål gällande sexuella handlingar har betydelse för verket.
top concept of: Queerlit

Queera personer
type: Concept
issued: 2022-05-19T10:12:00
modified: 2022-06-07T15:09:28
alternative label: Queers
broader: Hbtqi-personer
in scheme: Queerlit
narrower: Queera föräldrar
narrower: Äldre queera personer
narrower: Queera ungdomar
narrower: Queera barn
narrower: Queera par
narrower: Queera nyutkomna
narrower: Queera prostituerade
related: Queera familjer
related: Queera föräldrar
related: Föräldrar till queera personer
related: Återvunna termer
related: Queerfobi
related: Förföljelse av queera personer
scope note: Används för skildringar av personer som beskrivs som queera.

Sexuell läggning
type: Concept
issued: 2022-05-19T10:12:00
modified: 2022-10-26T08:10:16
in scheme: Queerlit
narrower: Allosexualitet
narrower: Asexualitet
narrower: Homosexualitet
narrower: Demisexualitet
narrower: Megasexualitet
narrower: Bisexualitet
narrower: Heterosexualitet
related: Sexuell preferens
related: Förnekande av sexuell läggning
related: Sexuell omvändelse
related: Relationspreferens
related: Sexuell identitet
scope note: Används för skildringar av riktningen på någons sexuella attraktion, gentemot samma, motsatt, flera eller inget kön. För skildringar som fokuserar på personers identitet, använd ämnesordet "Sexuell identitet" eller något av dess smalare ämnesord.
top concept of: Queerlit

Outning
type: Concept
issued: 2022-05-19T10:12:00
modified: 2024-09-05T13:44:36
alternative label: Att outa någon
alternative label: Outing
broader: Hbtqi-aktivism
in scheme: Queerlit
related: Diskretion (hbtqi)
related: Nyutkomna lesbiska
related: Nyutkomna bögar
related: Nyutkomna bisexuella
related: Komma ut
related: Garderobsbisexuella
related: Ryktesspridning (hbtqi)
related: Utpressning (hbtqi)
related: Garderobsbögar
related: Garderobslesbiska
related: Nyutkomna intersexpersoner
related: Nyutkomna transpersoner
related: Stealth (transpersoner)
related: Queera nyutkomna
scope note: Används för skildringar av att utan medgivande offentliggöra någon annans sexuella läggning, transitionserfarenhet eller intersextillstånd.

Officiell dokumentation
type: Concept
issued: 2022-05-19T10:12:00
modified: 2022-05-19T10:12:00
broader: Rättsstatus
in scheme: Queerlit
narrower: Samboavtal
narrower: Namnändring
narrower: Pass
narrower: Domstolsbeslut
narrower: Läkarutlåtanden
narrower: Id-kort
narrower: Körkort
related: Juridiskt namn
related: Asylrätt (hbtqi)
related: Samboförhållanden
related: Familjerätt (hbtqi)
related: Juridiskt kön
related: Registrerade partnerskap
related: Äktenskap
scope note: Används för skildringar där dokument och handlingar utfärdade av en juridisk, medicinsk eller på annat vis offentlig instans har betydelse för verket.

Transitionering
type: Concept
issued: 2022-05-19T10:12:00
modified: 2024-06-05T11:38:19
alternative label: Transition
broader: Könsöverskridanden
in scheme: Queerlit
narrower: Detransitionering
related: Könsidentitetsutredning
related: Pass
related: Transsexuella
related: Transsexualism
related: Röstträning (transpersoner)
related: Hårborttagning
related: Könsidentitet
related: Läkarutlåtanden
related: Könsbekräftande behandling
related: Id-kort
related: Körkort
related: Tilldelat kön vid födseln
related: Transpersoner
scope note: Används för skildringar av en könsbekräftande process för att leva i överensstämmelse med sin könsidentitet, t.ex. genom att ändra namn, kropp och/eller pronomen.

Könsroller
type: Concept
issued: 2022-05-19T10:12:00
modified: 2022-05-19T10:12:00
broader: Rollbeteende
hidden label: Köns-roller
in scheme: Queerlit
narrower: Flickpojkar
narrower: Machokultur
narrower: Pojkflickor
related: Könsuttryck
related: Maskulinitet
related: Androgynitet
related: Sexualitet
related: Könsidentitet
related: Femmes
related: Genderbending
related: Könsförhållanden
related: Femininitet
related: Butchar
related: Björnar (identitet)
scope note: Används för skildringar där könsroller - socialt och kulturellt kön - har betydelse för verket.

Äktenskap
type: Concept
issued: 2022-05-19T10:12:00
modified: 2023-12-06T09:24:17
broader: Samlevnadsformer
in scheme: Queerlit
narrower: Blandäktenskap (sexuell läggning)
narrower: Samkönade äktenskap
narrower: Samvetsäktenskap
narrower: Olikkönade äktenskap
narrower: Civilstånd
narrower: Skilsmässor (hbtqi)
related: Samboavtal
related: Äktenskapslagstiftning
related: Gifta hbtqi-par
related: Namnändring
related: Frieri (hbtqi)
related: Samboförhållanden
related: Officiell dokumentation
related: Registrerade partnerskap
related: Bröllop (hbtqi)
scope note: Används för skildringar av äktenskap - juridiskt, kulturellt och/eller religiöst erkända samlevnadsformer mellan personer som gift sig.

Partners (hbtqi)
type: Concept
issued: 2022-05-19T10:12:00
modified: 2023-12-06T09:24:17
broader: Hbtqi-familjer
broader: Familjemedlemmar
in scheme: Queerlit
narrower: Partners till transpersoner
narrower: Primära partners
narrower: Partners till bisexuella
narrower: Partners till intersexpersoner
narrower: Partners till homosexuella
narrower: Partners till queera personer
narrower: Före detta partners (hbtqi)
narrower: Metamourer
related: Partnerpreferens
related: Sexuell preferens
related: Våld i nära relationer (hbtqi)
related: Samboförhållanden
related: Hbtqi-par
related: Relationer (hbtqi)
related: Älskare (hbtqi)
scope note: Används för skildringar av personer som är partners till hbtqi-personer, oavsett partnerns egen identitet.

Förföljelse av hbtqi-personer
type: Concept
issued: 2022-05-19T10:12:00
modified: 2023-12-06T09:24:17
in scheme: Queerlit
narrower: Förföljelse av bisexuella
narrower: Förtalskampanjer (hbtqi)
narrower: Förföljelse av transpersoner
narrower: Polisräder
narrower: Förföljelse av intersexpersoner
narrower: Förföljelse av homosexuella
narrower: Förföljelse av queera personer
related: Intolerans mot hbtqi-personer
related: Våld mot hbtqi-personer
related: Skällsord
related: Papperslösa hbtqi-personer
related: Polistrakasserier
related: Arresteringar av hbtqi-personer
related: Flyktingar (hbtqi)
related: Diskriminering av hbtqi-personer
scope note: Används för skildringar av förföljelse av hbtqi-personer på grund av deras sexuella läggning, könsidentitet och/eller könsuttryck.
top concept of: Queerlit

Hbtqi-familjer
type: Concept
issued: 2022-05-19T10:12:00
modified: 2024-09-05T13:44:36
alternative label: Regnbågsfamiljer
in scheme: Queerlit
narrower: Partners (hbtqi)
narrower: Intersexfamiljer
narrower: Föräldrar (hbtqi)
narrower: Queera familjer
narrower: Transfamiljer
narrower: Valda familjer (hbtqi)
narrower: Fosterfamiljer (hbtqi)
narrower: Homosexuella familjer
narrower: Familjer med ensamstående föräldrar
narrower: Adoptivfamiljer (hbtqi)
narrower: Bisexuella familjer
related: Syskon
related: Skaffa barn (hbtqi)
related: Familjemedlemmar
related: Adoption (hbtqi)
scope note: Används för skildringar av familjer med hbtqi-personer, vare sig de är valda familjer eller uppväxtfamiljer.
top concept of: Queerlit

Könsuttryck
type: Concept
issued: 2022-05-19T10:12:00
modified: 2022-09-12T08:21:55
broader: Kön
hidden label: Köns-uttryck
in scheme: Queerlit
narrower: Maskulinitet
narrower: Transvestism
narrower: Tuckning
narrower: Androgynitet
narrower: Crossdressing
narrower: Röstträning (transpersoner)
narrower: Pronomen
narrower: Hårborttagning
narrower: Genderbending
narrower: Packing (fallos)
narrower: Femininitet
narrower: Binding (bröstkorg)
related: Kläder
related: Dragartister
related: Könsidentitet
related: Dandyer
related: Björnar (identitet)
related: Könsroller
scope note: Används för skildringar där sätt att uttrycka och förmedla kön, t.ex. kläder, frisyr, beteenden och språkbruk, har betydelse för verket.

Homosexuella
type: Concept
issued: 2022-05-19T10:12:00
modified: 2023-12-13T10:57:15
broader: Hbtqi-personer
in scheme: Queerlit
narrower: Äldre homosexuella
narrower: Homosexuella föräldrar
narrower: Bögar
narrower: Lesbiska
narrower: Homosexuella barn
narrower: Homosexuella par
narrower: Prostituerade homosexuella
narrower: Unga homosexuella
related: Homosexuella gemenskaper
related: Allosexualitet
related: Homosexualitet
related: Föräldrar till homosexuella
related: Stockholmare (hbtqi)
related: Perverterade
related: Homofobi
related: Såna (hbtqi)
related: Partners till homosexuella
related: Förföljelse av homosexuella
related: Vänner (älskare)
scope note: Används för skildringar av personer som huvudsakligen bli kära i och/eller attraherade av personer av samma kön som dem själva.

Bisexuella
type: Concept
issued: 2022-05-19T10:12:00
modified: 2023-12-06T09:24:17
alternative label: Bisexuella personer
broader: Hbtqi-personer
in scheme: Queerlit
narrower: Prostituerade bisexuella
narrower: Bisexuella män
narrower: Nyutkomna bisexuella
narrower: Garderobsbisexuella
narrower: Bisexuella kvinnor
narrower: Bisexuella föräldrar
narrower: Bisexuella barn
narrower: Bisexuella par
narrower: Unga bisexuella
narrower: Äldre bisexuella
related: Allosexualitet
related: Förföljelse av bisexuella
related: Föräldrar till bisexuella
related: Bifobi
related: Partners till bisexuella
related: Pansexuella
related: Bisexuella gemenskaper
related: Bisexualitet
related: Bisexuella familjer
scope note: Används för skildringar av personer med förmågan att känna sexuell och/eller romantisk attraktion till människor oavsett kön.

Intersexpersoner
type: Concept
issued: 2022-05-19T10:12:00
modified: 2024-09-05T13:44:36
alternative label: Intersexuella
broader: Hbtqi-personer
hidden label: Intersex-personer
in scheme: Queerlit
narrower: Prostituerade intersexpersoner
narrower: Intersexföräldrar
narrower: Äldre intersexpersoner
narrower: Intersexbarn
narrower: Nyutkomna intersexpersoner
narrower: Intersexpar
narrower: Unga intersexpersoner
related: Könsstympning av intersexpersoner
related: Intersexgemenskaper
related: Förföljelse av intersexpersoner
related: Partners till intersexpersoner
related: Passera (kön)
related: Intersexfobi
related: Kvinnomän
related: Intersextillstånd
related: Föräldrar till intersexpersoner
related: Androgynos
related: Mankvinnor
related: Hermafroditer
scope note: Används för skildringar av personer med en medfödd variation i sin könskaraktäristika (gener, könshormon och/eller könsorgan) som inte stämmer överens med hur en typiskt kvinnlig eller typiskt manlig kropp förväntas vara.

Föräldrar (hbtqi)
type: Concept
issued: 2022-05-19T10:12:00
modified: 2023-12-06T09:24:17
alternative label: Mappor
alternative label: Pammor
broader: Hbtqi-familjer
broader: Familjemedlemmar
in scheme: Queerlit
narrower: Medföräldrar (hbtqi)
narrower: Pappor
narrower: Homosexuella föräldrar
narrower: Queera föräldrar
narrower: Intersexföräldrar
narrower: Transföräldrar
narrower: Adoptivföräldrar (hbtqi)
narrower: Ensamstående föräldrar (hbtqi)
narrower: Föräldrar till hbtqi-personer
narrower: Bisexuella föräldrar
narrower: Flersamt föräldraskap
narrower: Biologiska föräldrar (hbtqi)
narrower: Mammor
narrower: Fosterföräldrar (hbtqi)
narrower: Okönade föräldrar
narrower: Mor- och farföräldrar
related: Föräldrarätt
related: Skaffa barn (hbtqi)
related: Hbtqi-barn
related: Adoption (hbtqi)
scope note: Används för skildringar av föräldrar som är hbtqi-personer och/eller är föräldrar till hbtqi-personer.

Bögar
type: Concept
issued: 2022-05-19T10:12:00
modified: 2023-02-07T17:15:49
alternative label: Gays
alternative label: Homosexuella män
alternative label: Manlig homosexualitet
alternative label: Manliga homosexuella
broader: Homosexuella
broader: Män
in scheme: Queerlit
narrower: Prostituerade bögar
narrower: Nyutkomna bögar
narrower: Uttrar (identitet)
narrower: Bögföräldrar
narrower: Äldre bögar
narrower: Garderobsbögar
narrower: Björnar (identitet)
narrower: Homosexuella pojkar
narrower: Bögpar
narrower: Unga bögar
related: Relationer mellan lesbiska och bögar
related: Partners till bögar
related: Föräldrar till bögar
related: Böggemenskaper
related: Återvunna termer
related: Kvinnomän
related: Män som har sex med män
related: Fjollor
related: Kärlek mellan män
related: Förföljelse av bögar
scope note: Används för skildringar av personer som beskrivs som pojkar eller män och som blir kära i och/eller attraherade av andra pojkar/män. Kan även användas för skildringar av bögidentiteter utan koppling till tvåkönsmodellen.

BDSM
type: Concept
issued: 2022-05-19T10:12:00
modified: 2024-09-05T13:44:36
broader: Sexuella praktiker
broader: Sex
in scheme: Queerlit
narrower: Piskor
narrower: SM
narrower: Bondage
narrower: Masochism
related: Piskor
related: Disciplinbollar
related: Dominatrixer (hbtqi)
related: Dominanta (hbtqi)
related: Switchar (BDSM)
related: BDSM-gemenskaper
related: Masters (hbtqi)
related: Sexuell identitet
related: Fetischism (sexualitet)
related: Sexslavar (hbtqi)
related: Sadism
related: Ögonbindlar
related: Ageplay
related: Undergivna (hbtqi)
related: Smiskning
related: Sexuellt samtycke
scope note: Används för skildringar av sexuella preferenser och former av personliga relationer som involverar samtyckesbaserat fasthållande och/eller intensiva sensoriska upplevelser, t.ex. i form av smärta och maktbaserade rollspel.

Sexuell preferens
type: Concept
issued: 2022-05-19T10:12:00
modified: 2024-06-05T11:38:19
in scheme: Queerlit
narrower: Partnerpreferens
narrower: Efebofili
narrower: Sexuella roller
narrower: Fetischism (sexualitet)
narrower: Pederaster
narrower: Demisexuella
narrower: Masochism
narrower: Gerontofili
narrower: Sadism
narrower: Voyeurism
related: Partners (hbtqi)
related: Vampyrism (sexualitet)
related: Sexuell omvändelse
related: Oskuld
related: Sexuell identitet
related: Tillfälligt sex
related: Bondage
related: Sexuell inversion
related: Pederasti
related: Situationsbetingat sexuellt beteende
related: Sexuella relationer
related: Sexuell läggning
scope note: Används för skildringar av återkommande mönster av attraktion till ett eller flera kön, karaktärsdrag, objekt, situationer eller beteenden.
top concept of: Queerlit

Könsidentitet
type: Concept
issued: 2022-05-19T10:12:00
modified: 2023-03-29T10:25:38
broader: Kön
hidden label: Köns-identitet
in scheme: Queerlit
narrower: Travesti
narrower: Kvinnor
narrower: Hijre
narrower: Katoey
narrower: Androgynos
narrower: Transpersoner
narrower: Cispersoner
narrower: Tredje könet
narrower: Eunucker
narrower: Män
narrower: Two-spirit
related: Könsuttryck
related: Könsdysfori
related: Relationspreferens
related: Sexuell identitet
related: Könseufori
related: Rollbeteende
related: Transitionering
related: Demigenderpersoner
related: Agenderpersoner
related: Transpersoner
related: Cispersoner
related: Könsroller
scope note: Används för skildringar av en persons upplevelse av att vara ett, flera eller inget kön.

Relationer (hbtqi)
type: Concept
issued: 2022-05-19T10:12:00
modified: 2023-12-06T09:24:17
in scheme: Queerlit
narrower: Relationer mellan män
narrower: Interkulturella relationer
narrower: Queera relationer
narrower: Transrelationer
narrower: Hbtqi-par
narrower: Vänskap
narrower: Relationer mellan okönade personer
narrower: Dejtande (hbtqi)
narrower: Butch-femme relationer
narrower: Intergenerationella relationer
narrower: Relationer mellan kvinnor
narrower: Bisexuella relationer
narrower: Intersexrelationer
narrower: Sexuella relationer
narrower: Homosexuella relationer
narrower: Heterosocialitet
related: Partners (hbtqi)
related: Kärlek (hbtqi)
related: Samboförhållanden
related: Separationer (hbtqi)
related: Relationspreferens
related: Familjemedlemmar
related: Förälskelse (hbtqi)
related: Svartsjuka (hbtqi)
scope note: Används för skildringar av nära relationer mellan hbtqi-personer. Kan omfatta aspekter som släktskap, vänskap, sex eller kärlek, men då någon av dessa har en övervägande betydelse används termerna "Familjemedlemmar", "Vänskap", "Sexuella relationer (hbtqi)" eller "Kärlek (hbtqi)".
top concept of: Queerlit

Sexualitet
type: Concept
issued: 2022-05-19T10:12:00
modified: 2022-05-19T10:12:00
in scheme: Queerlit
narrower: Sexualpolitiska organisationer
narrower: Barns sexualitet
related: Sexuella roller
related: Anonymt sex
related: Sexuell avhållsamhet
related: Sexställen
related: Gruppsex
related: Cybersex
related: Sexhjälpmedel
related: Förförelse
related: Tillfälligt sex
related: Erotik
related: Sexuella praktiker
related: Situationsbetingat sexuellt beteende
related: Genusvetenskap
related: Sexindustri
related: Sextning
related: Sexuell dysfunktion
related: Hypersexualitet
related: Sexklubbar
related: Sex
related: Sexfester
related: Könsroller
related: Sexuell upphetsning
related: Orgasm
related: Offentligt sex
scope note: Används för skildringar av erotiska, fysiska, känslomässiga, sociala, andliga och biologiska känslor och beteenden rörande lust och intimitet.
top concept of: Queerlit

Lesbiska
type: Concept
issued: 2022-05-19T10:12:00
modified: 2024-09-05T13:44:36
alternative label: Homosexuella kvinnor
alternative label: Kvinnlig homosexualitet
alternative label: Kvinnliga homosexuella
alternative label: Lesbianer
alternative label: Lesbiska kvinnor
broader: Kvinnor
broader: Homosexuella
in scheme: Queerlit
narrower: Nyutkomna lesbiska
narrower: Unga lesbiska
narrower: Äldre lesbiska
narrower: Lesbiska föräldrar
narrower: Prostituerade lesbiska
narrower: Lesbiska par
narrower: Femmes
narrower: Garderobslesbiska
narrower: Butchar
narrower: Lesbiska flickor
related: Kvinnor som har sex med kvinnor
related: Relationer mellan lesbiska och bögar
related: Flator
related: Amasoner
related: Tribader
related: Lesbiska gemenskaper
related: Sapfister
related: Kärlek mellan kvinnor
related: Lotusar (hbtqi)
related: Förföljelse av lesbiska
related: Vampyrer (hbtqi)
related: Dyke march
related: Föräldrar till lesbiska
related: Partners till lesbiska
related: Lesbofobi
related: Mankvinnor
scope note: Används för skildringar av personer som beskrivs som flickor eller kvinnor och som blir kära i och/eller attraherade av andra flickor/kvinnor. Kan även användas för skildringar av lesbiska identiteter utan koppling till tvåkönsmodellen.

Sexhjälpmedel
type: Concept
issued: 2022-05-19T10:12:00
modified: 2024-09-05T13:44:36
alternative label: Sexaccessoarer
alternative label: Sexaccessoirer
alternative label: Sexleksaker
hidden label: Sex-hjälpmedel
in scheme: Queerlit
narrower: Analkulor
narrower: Piskor
narrower: Handklovar
narrower: Disciplinbollar
narrower: Underkläder
narrower: Poppers
narrower: Floggers
narrower: Korsetter
narrower: Spridstänger
narrower: Sexdockor
narrower: Smiskpaddlar
narrower: Harness
narrower: Kondomer
narrower: Bröstvårtsklämmor
narrower: Glidmedel
narrower: Dildoar
narrower: Koppel
narrower: Replekar (BDSM)
narrower: Ögonbindlar
narrower: Vibratorer
narrower: Halsband (BDSM)
narrower: Penisringar
narrower: Slicklappar
narrower: Buttpluggar
narrower: Latexhandskar
related: Sexualitet
related: Sexbutiker
related: Sexuella praktiker
related: Sex
scope note: Används för skildringar av olika typer av föremål som används i sexuella praktiker.
top concept of: Queerlit

Hbtqi-personer
type: Concept
issued: 2022-05-19T10:12:00
modified: 2024-09-05T13:44:36
alternative label: Hbt-personer
alternative label: Hbtq-personer
alternative label: Sexuella minoriteter
in scheme: Queerlit
narrower: Hbtqi-aktivister
narrower: Sjöfolk (hbtqi)
narrower: Kvinnor som har sex med kvinnor
narrower: Äldre hbtqi-personer
narrower: Krigsoffer (hbtqi)
narrower: Idrottare (hbtqi)
narrower: Hbtqi-par
narrower: Ensamstående föräldrar (hbtqi)
narrower: Brottsoffer (hbtqi)
narrower: Homosexuella
narrower: Bisexuella
narrower: Intersexpersoner
narrower: Artister (hbtqi)
narrower: Pansexuella
narrower: Fysiskt funktionshindrade hbtqi-personer
narrower: Hbtqi-barn
narrower: Etniska grupper (hbtqi)
narrower: Migranter (hbtqi)
narrower: Fångar (hbtqi)
narrower: Älskare (hbtqi)
narrower: Män som har sex med män
narrower: Hbtqi-personer med NPF
narrower: Transpersoner
narrower: Hbtqi-ungdomar
narrower: Queera personer
narrower: Hbtqi-personer i militären
narrower: Hemlösa hbtqi-personer
narrower: Hbtqi-personer med intellektuella funktionsnedsättningar
narrower: Hbtqi-personer i avvänjning
related: Adoptivföräldrar (hbtqi)
related: Föräldrar till hbtqi-personer
related: Biologiska föräldrar (hbtqi)
related: Fosterföräldrar (hbtqi)
scope note: Används för skildringar av personer som beskrivs som homosexuella, bisexuella, transpersoner, queera och/eller intersexpersoner, eller som på andra sätt genom begär, praktik, identitet och/eller kropp bryter mot hetero- och/eller cisnormer.
top concept of: Queerlit

Historiska termer (hbtqi)
type: Concept
issued: 2022-05-19T10:12:00
modified: 2023-12-13T10:57:15
alternative label: Föråldrade begrepp (hbtqi)
alternative label: Föråldrade ord (hbtqi)
alternative label: Föråldrade termer (hbtqi)
alternative label: Historiska begrepp (hbtqi)
in scheme: Queerlit
narrower: Främmande seder (hbtqi)
narrower: Uranism
narrower: Inverterade
narrower: Kvinnohatare (hbtqi)
narrower: Gossekärlek
narrower: Stockholmare (hbtqi)
narrower: Perverterade
narrower: Transvestiter
narrower: Ergi
narrower: Pederaster
narrower: Sodomiter
narrower: Manshatare (hbtqi)
narrower: Sodomi
narrower: Sexuell inversion
narrower: Tribader
narrower: Såna (hbtqi)
narrower: Pederasti
narrower: Sapfister
narrower: Bugrar
narrower: Homofiler
narrower: Lotusar (hbtqi)
narrower: Vampyrer (hbtqi)
narrower: Eonism
narrower: Kvinnomän
narrower: Dandyer
narrower: Urningar
narrower: Frottage
narrower: Vänner (älskare)
narrower: Fjollor
narrower: Tredje könet
narrower: Mankvinnor
narrower: Hermafroditer
related: Bostonäktenskap
scope note: Används för skildringar, historiska eller historiserande, där föråldrade begrepp brukas för att beskriva samkönade sexuella praktiker, känslor och/eller identiteter eller överskridanden av binära könsnormer genom kropp, klädsel och/eller identitet.
top concept of: Queerlit

Könsöverskridanden
type: Concept
issued: 2022-05-19T10:12:00
modified: 2023-03-29T10:53:01
hidden label: Köns-överskridanden
in scheme: Queerlit
narrower: Förvandlingssymbolik (hbtqi)
narrower: Könsidentitetsutredning
narrower: Transgemenskaper
narrower: Transseparatism
narrower: Transrörelser
narrower: Herrimitatörer
narrower: Könsdysfori
narrower: Transvestism
narrower: Transfamiljer
narrower: Tuckning
narrower: Kabuki
narrower: Androgynitet
narrower: Crossdressing
narrower: Transstudier
narrower: Transsexualism
narrower: Transrelationer
narrower: Draggemenskaper
narrower: Transfobi
narrower: Travesti
narrower: Dragartister
narrower: Könseufori
narrower: Passera (kön)
narrower: Genderbending
narrower: Könsbekräftande behandling
narrower: Packing (fallos)
narrower: Hijre
narrower: Eonism
narrower: Transitionering
narrower: Transkultur
narrower: Katoey
narrower: Damimitatörer
narrower: Stealth (transpersoner)
narrower: Tilldelat kön vid födseln
narrower: Transpersoner
narrower: Dragbaler
narrower: Trans march
narrower: Tredje könet
narrower: Könsväxlingar
narrower: Two-spirit
scope note: Används för skildringar där könsidentiteter, könsuttryck eller föreställningar om kön beskrivs som överskridande binära könsnormer. Detta övergripande ämnesord är huvudsakligen menat som ett paraplybegrepp för att möjliggöra inkluderande sökningar, eller för skildringar där ingen smalare term är tillämpbar.
top concept of: Queerlit

Transpersoner
type: Concept
issued: 2022-05-19T10:12:00
modified: 2023-03-29T10:25:38
alternative label: TGD-personer
alternative label: Trans
alternative label: Trans*
broader: Könsöverskridanden
broader: Könsidentitet
broader: Hbtqi-personer
in scheme: Queerlit
narrower: Äldre transpersoner
narrower: Transmän
narrower: Transfeminina
narrower: Transpar
narrower: Unga transpersoner
narrower: Transsexuella
narrower: Transvestiter
narrower: Prostituerade transpersoner
narrower: Transföräldrar
narrower: MtX
narrower: Genderfluid-personer
narrower: Transbarn
narrower: Transmaskulina
narrower: Transkvinnor
narrower: Bigender-personer
narrower: FtX
narrower: Tredje kön-personer
narrower: Nyutkomna transpersoner
narrower: Demigenderpersoner
narrower: Ickebinära personer
narrower: Androgyna personer
narrower: Agenderpersoner
related: Föräldrar till transpersoner
related: Partners till transpersoner
related: Transgemenskaper
related: Könsdysfori
related: Transsexualism
related: Förföljelse av transpersoner
related: Hormonbehandling (kön)
related: Transfobi
related: Kvinnor
related: Könsidentitet
related: Könseufori
related: Passera (kön)
related: Könsbekräftande behandling
related: Eonism
related: Transitionering
related: Stealth (transpersoner)
related: Cispersoner
related: Män
scope note: Används för skildringar av personer som genom sitt könsuttryck eller könsidentitet skiljer sig från det kön de tilldelats vid födseln.

Sexuell identitet
type: Concept
issued: 2022-05-19T10:12:00
modified: 2023-05-10T08:32:00
in scheme: Queerlit
narrower: Sexuella roller
narrower: Dominatrixer (hbtqi)
narrower: Dominanta (hbtqi)
narrower: Chubs (identitet)
narrower: Switchar (BDSM)
narrower: Masters (hbtqi)
narrower: Pederaster
narrower: Uttrar (identitet)
narrower: Sexslavar (hbtqi)
narrower: Megasexualitet
narrower: Demisexuella
narrower: Femmes
narrower: Faeries
narrower: Dandyer
narrower: Butchar
narrower: Undergivna (hbtqi)
narrower: Björnar (identitet)
narrower: Megasexuella
related: Polyamori
related: Partnerpreferens
related: Monogami
related: Bögkultur
related: Sexuell preferens
related: Interkulturella relationer
related: Sexuella roller
related: Lesbisk kultur
related: Ballroomkultur
related: Dekadens
related: Draggemenskaper
related: Essentialism
related: Fetischism (sexualitet)
related: Butch-femme relationer
related: Intergenerationella relationer
related: Rollspel (sexualitet)
related: BDSM
related: Könsidentitet
related: Rollbeteende
related: Masochism
related: Femmes
related: Transkultur
related: Flersamma relationer
related: Sexuell läggning
scope note: Används för skildringar av personers uppfattning av sig själva i relation till vem eller vad de attraheras av, både romantiskt och sexuellt.
top concept of: Queerlit

Sex
type: Concept
issued: 2022-05-19T10:12:00
modified: 2023-06-14T12:30:11
in scheme: Queerlit
narrower: Raggning (hbtqi)
narrower: Urinsex
narrower: Cruising
narrower: Lersex
narrower: Strap-onsex
narrower: Analsex
narrower: Kyssar
narrower: Oralsex
narrower: Onani
narrower: Samlag
narrower: Sexuell avhållsamhet
narrower: Sex med händerna
narrower: Penissex
narrower: Vaginalsex
narrower: Erotisk massage
narrower: Cunnilingus
narrower: Autoerotisk kvävning
narrower: Rollspel (sexualitet)
narrower: BDSM
narrower: Gummisex
narrower: Sextning
narrower: Fellatio
narrower: Gemensam onani
narrower: Frottage
narrower: Säkrare sex
narrower: Tantrasex
narrower: Telefonsex
narrower: Nipple play
narrower: Exhibitionism
narrower: Klitorissex
narrower: Sex på offentliga toaletter
narrower: Voyeurism
narrower: Kemsex
related: Sexställen
related: Sexhjälpmedel
related: Sexualitet
related: Sodomi
related: Situationsbetingat sexuellt beteende
related: Masochism
related: Sadism
related: Frottage
related: Sexuellt samtycke
related: Sexuell upphetsning
related: Orgasm
scope note: Används för skildringar av fysisk och/eller känslomässig interaktion med en annan person eller ett annat föremål, med den specifika avsikten att uppnå sexuell upphetsning eller klimax.
top concept of: Queerlit

Sexuella praktiker
type: Concept
issued: 2022-05-19T10:12:00
modified: 2023-06-14T12:30:11
in scheme: Queerlit
narrower: Raggning (hbtqi)
narrower: Striptease
narrower: Urinsex
narrower: Cruising
narrower: Lersex
narrower: Vampyrism (sexualitet)
narrower: Analsex
narrower: Kyssar
narrower: Oralsex
narrower: Anonymt sex
narrower: Onani
narrower: Samlag
narrower: Bitning (sexualitet)
narrower: Gruppsex
narrower: Cybersex
narrower: Rituell homosexualitet
narrower: Sex med händerna
narrower: Penissex
narrower: Vaginalsex
narrower: Erotisk massage
narrower: Tillfälligt sex
narrower: Bondage
narrower: Cunnilingus
narrower: Autoerotisk kvävning
narrower: BDSM
narrower: Gummisex
narrower: Fellatio
narrower: Gemensam onani
narrower: Frottage
narrower: Säkrare sex
narrower: Tantrasex
narrower: Telefonsex
narrower: Nipple play
narrower: Exhibitionism
narrower: Smiskning
narrower: Klitorissex
narrower: Sex på offentliga toaletter
narrower: Voyeurism
narrower: Kemsex
narrower: Offentligt sex
narrower: Nypning (sexualitet)
related: Sexhjälpmedel
related: Sexualitet
related: Sodomi
related: Situationsbetingat sexuellt beteende
related: Sexuellt samtycke
scope note: Används för skildringar av aktiviteter inriktade på fysiska och/eller mentala sexuella stimuli, inklusive men inte begränsat till samlag och sexuell njutning.
top concept of: Queerlit

Queerlit
type: ConceptScheme
has top concept: Kläder
has top concept: Könsstympning av intersexpersoner
has top concept: Porrfilmer (hbtqi)
has top concept: Sociala processer (hbtqi)
has top concept: Hbtqi-aktivism
has top concept: Hbtqi-mötesplatser
has top concept: Intolerans mot hbtqi-personer
has top concept: Samlevnadsformer
has top concept: Våld mot hbtqi-personer
has top concept: Psykisk ohälsa
has top concept: Skällsord
has top concept: Misogyni
has top concept: Hbtqi-barer
has top concept: Symbolik (hbtqi)
has top concept: Personer som lever med hiv
has top concept: Informationsförmedling
has top concept: Hbtqi-fobi
has top concept: Sexuell preferens
has top concept: Sexarbetare (hbtqi)
has top concept: Sociala medier
has top concept: Förnekande av sexuell läggning
has top concept: Förföljelse av hbtqi-personer
has top concept: Trakasserier
has top concept: Hbtqi+
has top concept: Ateism (hbtqi)
has top concept: Äldre
has top concept: Preventivmedel
has top concept: Diskretion (hbtqi)
has top concept: Hbtqi-slang
has top concept: Religion (hbtqi)
has top concept: Heterosexuella
has top concept: Sociala normer
has top concept: Djur (hbtqi)
has top concept: Barn
has top concept: Sexuell revolution
has top concept: Könsöverskridanden
has top concept: Sexställen
has top concept: Gudinnerörelser (hbtqi)
has top concept: Spekulationer (hbtqi)
has top concept: Hbtqi-föreningar
has top concept: Religiösa ledare (hbtqi)
has top concept: Relationspreferens
has top concept: Sexuell identitet
has top concept: Celibat
has top concept: Självförtryck (hbtqi)
has top concept: Hbtqi-evenemang
has top concept: Sexhjälpmedel
has top concept: Äldreboenden (hbtqi)
has top concept: Badplatser (hbtqi)
has top concept: Sexualitet
has top concept: Tvångssterilisering
has top concept: TV (hbtqi)
has top concept: Feminism
has top concept: Offentliga hygieninrättningar
has top concept: Musikaler
has top concept: Körer (hbtqi)
has top concept: Sexuella riskbeteenden
has top concept: Förförelse
has top concept: Komma ut
has top concept: Substansmissbruk (hbtqi)
has top concept: Kravaller (hbtqi)
has top concept: Sexuellt våld
has top concept: Relationer (hbtqi)
has top concept: Censur
has top concept: Skolan (hbtqi)
has top concept: Könssjukdomar
has top concept: Litterära salonger (hbtqi)
has top concept: Aromantiska (hbtqi)
has top concept: Camp
has top concept: Förläggare (hbtqi)
has top concept: Utpressning (hbtqi)
has top concept: Massage
has top concept: Skaffa barn (hbtqi)
has top concept: Hiv-/aidsfobi
has top concept: Radio (hbtqi)
has top concept: Rättsstatus
has top concept: Erogena zoner
has top concept: Sexism
has top concept: Erotik